{"text_format":"1","workbook":"xlsx","n_sheets":5,"sheets":["Power Supply Config","Smokes","Circuit Config","Devices","Data"],"not_rendered":{"charts":0,"images":2,"macros":1,"external_links":0,"defined_names":8,"comments":1,"pivot_tables":0},"unopened":[],"bounds":{"document_bytes":16777216,"sheet_cells":100000,"rows_first":2000,"rows_last":500,"rows_between":2000,"halvings":0,"cell_chars":16384,"cell_head_chars":4096},"cells_cut":0,"cells_raw":0,"read":"whole","date_system":"1900"}

{"sheet":"Power Supply Config","index":0,"n_rows":57,"n_cols":13,"rows_kept":57,"cut":false,"hidden":false,"merged":[[18,12,19,12],[18,5,18,6],[20,2,20,3],[20,7,44,12],[21,2,21,3],[22,2,22,3],[24,2,24,3],[43,2,43,3],[3,9,3,10],[5,9,5,10],[7,9,7,10],[7,1,7,4],[3,5,3,6],[3,7,3,8],[5,5,5,6],[7,5,7,6],[7,7,7,8],[16,9,16,10],[16,2,16,4],[11,1,11,4],[14,2,14,4],[14,6,14,8],[9,9,11,10],[55,7,55,9],[54,7,54,12],[56,1,56,4],[8,1,8,4],[9,1,9,4],[18,1,19,1],[18,2,19,3],[18,4,19,4],[23,2,23,3],[14,9,14,10],[56,5,56,6],[54,5,54,6],[54,1,54,4],[49,2,49,3],[56,7,56,9],[53,1,53,4],[55,5,55,6],[55,1,55,4],[50,2,50,3],[52,1,52,4],[53,7,53,9],[45,2,45,3],[51,7,51,9],[51,1,51,4],[52,7,52,8],[48,2,48,3],[47,2,47,3]]}
[]
[]
[]
[null,null,null,null,null,"Project Name:",null,null,null,"Standby Hours:",null,24]
[]
[null,null,null,null,null,"Project ID:",null,null,null,"Alarm Mins:",null,5]
[]
[null,null,null,null,null,"Prepared By:",null,null,null,"Derating Factor:",null,1.2]
[]
[null,"6808 Battery Calculator (SD)",null,null,null,null,"Date:",null,null,"Voltage Drop Warning Threshold % :"]
[]
[null,"Version 18.05.29",null,null,null,null,null,null,null,null,null,10]
[]
[]
[null,"Panel ID: ",6808,null,null,"Model:","6808 Add. Fire Alarm Control Panel",null,null,"Max NAC Current: ",null,"3.0 Amps"]
[]
[null,"Location: ",null,null,null,"Volts:","24 VDC",null,null,"Max Panel Current: ",null,"5.0 Amps"]
[]
[null,"Ckt.#","Circuit Name",null,"Qty","Current Draw",null,"Wire AWG","Ohms Per","Length(ft)","Actual","Volts @","%Drop"]
[null,null,null,null,null,"Standby","Alarm","& Type","1000 Ft.","One-Way","Ohms","EOL"]
[null,6808,"6808 CTRL Panel",null,1,0.17,0.36499999999999999,{"$f":"IF(SUM(E22:E33)<=127,IF(SUM(E38:E44)<=31,\"N/A\",\"# of Modules Exceeds Panel Capacity (31)\"),\"# of Points Exceeds Panel Capacity (127)\")","v":"N/A"}]
[null,"SD500-AIM","Addr. Input Mod",null,null,{"$f":"E22*0.00055","v":0},{"$f":"E22*0.00055","v":0}]
[null,"SD500-MIM","Mini-Input Module",null,null,0,0]
[null,"SD500-ARM","Addr. Relay Module",null,null,0,0]
[null,"SD500-PS","Addr. Pull Station",null,null,0,0]
[null,"SD505-HEAT","Addr. Heat Detector",null,null,0,0]
[null,"SD505-PHOTO","Addr. Photo Smoke Det",null,null,0,0]
[null,"SD505-DUCTR","Addr. Duct w/Relay",null,null,0,0]
[null,"SD505-DUCT","Addr. Duct ",null,null,0,0]
[null,"SD500-ANM","Addr. Notification Module",null,null,0,0]
[null,"SD500-LED","Addr. LED Module",null,null,0,0]
[null,"SD500-SDM","Addr. Smoke Det. Mod.",null,null,0,0]
[null,"SD505-6RB","Addr. Det. Relay Base",null,null,{"$f":"E33*0.000082","v":0},{"$f":"E33*0.000082","v":0}]
[null,"SD505-6SB","Addr. Det. Sounder Base",null,null,{"$f":"E34*0.000082","v":0},{"$f":"E34*0.000082","v":0}]
[null,"SD505-6IB","Addr. Det. Isolator Base",null,null,{"$f":"E35*0.000092","v":0},{"$f":"E35*0.000092","v":0}]
[null,"SD500-LIM","Line Isolation Module",null,null,{"$f":"E36*0.000092","v":0},{"$f":"E36*0.000092","v":0}]
[null,6860,"LCD Remote Annunc",null,null,{"$f":"E37*0.025","v":0},{"$f":"E37*0.05","v":0}]
[null,5824,"Serial/Parallel Module",null,null,{"$f":"E38*0.045","v":0},{"$f":"E38*0.045","v":0}]
[null,5496,"Power Expander",null,null,{"$f":"E39*0.01","v":0},{"$f":"E39*0.01","v":0}]
[null,"5895XL","Power Expander",null,null,{"$f":"E40*0.01","v":0},{"$f":"E40*0.01","v":0}]
[null,"5865-4","LED Annunciator (4G)",null,null,{"$f":"E41*0.035","v":0},{"$f":"E41*0.145","v":0}]
[null,"5865-3","LED Annunciator (3G)",null,null,{"$f":"E42*0.035","v":0},{"$f":"E42*0.145","v":0}]
[null,5880,"LED Driver Module",null,null,{"$f":"E43*0.035","v":0},{"$f":"E43*0.2","v":0}]
[null,5883,"Relay Module",null,null,{"$f":"E44*0","v":0},{"$f":"E44*0.2","v":0}]
[null,"SK-NIC","Network Input Card",null,null,{"$f":"E45*0.021","v":0},{"$f":"E45*0.021","v":0}]
[null,"SK-FML","Muilti-Mode Fiber Card",null,0,{"$f":"E46*0.053","v":0},{"$f":"E46*0.053","v":0}]
[null,"SK-FSL","Single-Mode Fiber Card",null,0,{"$f":"E47*0.079","v":0},{"$f":"E47*0.079","v":0}]
[null,"NAC #1",{"$f":"VLOOKUP(Data!C30,Data!$A$23:$B$25,2)","v":"Notification Appl Circuit"},null,{"$f":"IF(G48>F48,G48,F48)","v":0},{"$f":"'Circuit Config'!F24","v":0},{"$f":"'Circuit Config'!G24","v":0},{"$f":"VLOOKUP(Data!B14,Data!$A$3:$D$10,2)","v":"#14 Solid"},{"$f":"VLOOKUP(Data!B14,Data!$A$3:$D$10,3)","v":2.52},null,{"$f":"((J48*2)/1000)*I48","v":0},{"$f":"20.4-(E48*K48)","v":20.399999999999999},{"$f":"IF(C48=Data!$B$24,\"N/A\",((20.4-L48)/20.4))","v":0}]
[null,"NAC #2",{"$f":"VLOOKUP(Data!C31,Data!$A$23:$B$25,2)","v":"Notification Appl Circuit"},null,{"$f":"IF(G49>F49,G49,F49)","v":0},{"$f":"'Circuit Config'!F39","v":0},{"$f":"'Circuit Config'!G39","v":0},{"$f":"VLOOKUP(Data!B15,Data!$A$3:$D$10,2)","v":"#12 Solid"},{"$f":"VLOOKUP(Data!B15,Data!$A$3:$D$10,3)","v":1.59},null,{"$f":"((J49*2)/1000)*I49","v":0},{"$f":"20.4-(E49*K49)","v":20.399999999999999},{"$f":"IF(C49=Data!$B$24,\"N/A\",((20.4-L49)/20.4))","v":0}]
[null,"NAC #3",{"$f":"VLOOKUP(Data!C32,Data!$A$23:$B$25,2)","v":"Notification Appl Circuit"},null,{"$f":"IF(G50>F50,G50,F50)","v":0},{"$f":"'Circuit Config'!F54","v":0},{"$f":"'Circuit Config'!G54","v":0},{"$f":"VLOOKUP(Data!B16,Data!$A$3:$D$10,2)","v":"#12 Solid"},{"$f":"VLOOKUP(Data!B16,Data!$A$3:$D$10,3)","v":1.59},null,{"$f":"((J50*2)/1000)*I50","v":0},{"$f":"20.4-(E50*K50)","v":20.399999999999999},{"$f":"IF(C50=Data!$B$24,\"N/A\",((20.4-L50)/20.4))","v":0}]
[null,"NAC #4",{"$f":"VLOOKUP(Data!C33,Data!$A$23:$B$25,2)","v":"Notification Appl Circuit"},null,{"$f":"IF(G51>F51,G51,F51)","v":0},{"$f":"'Circuit Config'!F69","v":0},{"$f":"'Circuit Config'!G69","v":0},{"$f":"VLOOKUP(Data!B17,Data!$A$3:$D$10,2)","v":"#12 Solid"},{"$f":"VLOOKUP(Data!B17,Data!$A$3:$D$10,3)","v":1.59},null,{"$f":"((J51*2)/1000)*I51","v":0},{"$f":"20.4-(E51*K51)","v":20.399999999999999},{"$f":"IF(C51=Data!$B$24,\"N/A\",((20.4-L51)/20.4))","v":0}]
[null,"Total Standby Current (Amps)",null,null,null,{"$f":"SUM(F21:F51)","v":0.17},{"$f":"SUM(G21:G51)","v":0.36499999999999999},"Total Alarm Current (Amps)"]
[null,"Standby Time In Hours",null,null,null,{"$f":"$L$4","v":24},{"$f":"$L$6/60","v":8.3333333333333329E-2},"Alarm Time In Minutes / 60",null,{"$f":"\"(\"&$L$6&\" Mins)\"","v":"(5 Mins)"}]
[null,"Total Standby AH Required",null,null,null,{"$f":"F53*F52","v":4.08},{"$f":"G53*G52","v":3.0416666666666665E-2},"Total Alarm AH Required"]
[null,"Total Combined AH Required",null,null,null,{"$f":"F54+G54","v":4.1104166666666666},null,"Command Shortcuts"]
[null,"Multiply By The Derating Factor",null,null,null,{"$f":"$L$8","v":1.2}]
[null,"Minimum Battery AmpHours Required",null,null,null,{"$f":"F55*F56","v":4.9325000000000001}]

{"sheet":"Smokes","index":1,"n_rows":211,"n_cols":7,"rows_kept":211,"cut":false,"hidden":false,"merged":[[1,2,3,3],[4,1,5,1],[4,2,5,2],[4,3,4,4]]}
[null,null,"Device Database"]
[null,null,"Device Database"]
[null,null,null,null,null,null,"                 Command Shortcuts"]
[]
[null,"Item#","Device / Description","Current Draw In Amperes"]
[null,null,null,"Standby","*Alarm"]
[null,1,"Unused"]
[null,2,"Gentex GCC24 Horn/Strobe (15cd)",0,0.14299999999999999]
[null,3,"Gentex GCC24 Horn/Strobe (30cd)",0,0.153]
[null,4,"Gentex GCC24 Horn/Strobe (75cd)",0,0.27]
[null,5,"Gentex GCC24 Horn/Strobe (95cd)",0,0.34100000000000003]
[null,6,"Gentex GCC24 Horn/Strobe (115cd)",0,0.38300000000000001]
[null,7,"Gentex GCC24 Horn/Strobe (150cd)",0,0.47699999999999998]
[null,8,"Gentex GCS24 Strobe (15cd)",0,0.12]
[null,9,"Gentex GCS24 Strobe (30cd)",0,0.13]
[null,10,"Gentex GCS24 Strobe (75cd)",0,0.247]
[null,11,"Gentex GCS24 Strobe (95cd)",0,0.318]
[null,12,"Gentex GCS24 Strobe (115cd)",0,0.36]
[null,13,"Gentex GCS24 Strobe (150cd)",0,0.45400000000000001]
[null,14,"Gentex GEC324 Horn/Strobe (15cd)",0,0.13400000000000001]
[null,15,"Gentex GEC324 Horn/Strobe (30cd)",0,0.152]
[null,16,"Gentex GEC324 Horn/Strobe (60cd)",0,0.193]
[null,17,"Gentex GEC324 Horn/Strobe (75cd)",0,0.23599999999999999]
[null,18,"Gentex GEC324 Horn/Strobe (110cd)",0,0.28000000000000003]
[null,19,"Gentex GES324 Strobe (15cd)",0,7.8E-2]
[null,20,"Gentex GES324 Strobe (30cd)",0,9.6000000000000002E-2]
[null,21,"Gentex GES324 Strobe (60cd)",0,0.13700000000000001]
[null,22,"Gentex GES324 Strobe (75cd)",0,0.18]
[null,23,"Gentex GES324 Strobe (110cd)",0,0.224]
[null,24,"Gentex GEC24 Horn/Strobe (15cd)",0,0.13300000000000001]
[null,25,"Gentex GEC24 Horn/Strobe (30cd)",0,0.151]
[null,26,"Gentex GEC24 Horn/Strobe (60cd)",0,0.192]
[null,27,"Gentex GEC24 Horn/Strobe (75cd)",0,0.23499999999999999]
[null,28,"Gentex GEC24 Horn/Strobe (110cd)",0,0.27900000000000003]
[null,29,"Gentex GEC24 Horn/Strobe (177cd)",0,0.34300000000000003]
[null,30,"Gentex GEH24 Horn",0,5.6000000000000001E-2]
[null,31,"Gentex GES24 Strobe (15cd)",0,7.8E-2]
[null,32,"Gentex GES24 Strobe (30cd)",0,9.6000000000000002E-2]
[null,33,"Gentex GES24 Strobe (60cd)",0,0.13700000000000001]
[null,34,"Gentex GES24 Strobe (75cd)",0,0.18]
[null,35,"Gentex GES24 Strobe (110cd)",0,0.224]
[null,36,"Gentex GES24 Strobe (177cd)",0,0.28799999999999998]
[null,37,"Gentex GX91 Mini-Horn (Continuous)",0,1.4999999999999999E-2]
[null,38,"Gentex GX93 Mini-Horn (Temporal)",0,2.1999999999999999E-2]
[null,39,"Gentex WGE Strobe (75cd)",0,0.18]
[null,40,"Gentex WGEC Horn/Strobe (75cd)",0,0.23599999999999999]
[null,41,"Silent Knight end of line relay EOL-1224RLY",1.4999999999999999E-2,1.4999999999999999E-2]
[null,42,"System Sensor CH Chime",0,5.3999999999999999E-2]
[null,43,"System Sensor CHS Chime/Stobe (15cd)",0,7.0000000000000007E-2]
[null,44,"System Sensor CHS Chime/Stobe (15/75cd)",0,8.1000000000000003E-2]
[null,45,"System Sensor CHS Chime/Strobe (30cd)",0,9.9000000000000005E-2]
[null,46,"System Sensor CHS Chime/Strobe (75cd)",0,0.16500000000000001]
[null,47,"System Sensor CHS Chime/Strobe (95cd)",0,0.189]
[null,48,"System Sensor CHS Chime/Strobe (110cd)",0,0.21]
[null,49,"System Sensor CHS Chime/Strobe (115cd)",0,0.217]
[null,50,"System Sensor HR/HRK/HW Horn",0,6.9000000000000006E-2]
[null,51,"System Sensor MH Mini-Horn",0,2.9000000000000001E-2]
[null,52,"System Sensor P2/PC2 Horn/Strobe (15cd)",0,9.0999999999999998E-2]
[null,53,"System Sensor P2/PC2 Horn/Strobe (15/75cd)",0,0.1]
[null,54,"System Sensor P2/PC2 Horn/Strobe (30cd)",0,0.11600000000000001]
[null,55,"System Sensor P2/PC2 Horn/Strobe (75cd)",0,0.17599999999999999]
[null,56,"System Sensor P2/PC2 Horn/Strobe (95cd)",0,0.20100000000000001]
[null,57,"System Sensor P2/PC2 Horn/Strobe (110cd)",0,0.221]
[null,58,"System Sensor P2/PC2 Horn/Strobe (115cd)",0,0.22900000000000001]
[null,59,"System Sensor P2/PC2 Horn/Strobe (135cd)",0,0.255]
[null,60,"System Sensor P2/PC2 Horn/Strobe (150cd)",0,0.27]
[null,61,"System Sensor P2/PC2 Horn/Strobe (177cd)",0,0.30199999999999999]
[null,62,"System Sensor P2/PC2 Horn/Strobe (185cd)",0,0.309]
[null,63,"System Sensor S/SC Strobe (15cd)",0,6.6000000000000003E-2]
[null,64,"System Sensor S/SC Strobe (15/75cd)",0,7.6999999999999999E-2]
[null,65,"System Sensor S/SC Strobe (30cd)",0,9.4E-2]
[null,66,"System Sensor S/SC Strobe (75cd)",0,0.158]
[null,67,"System Sensor S/SC Strobe (95cd)",0,0.18099999999999999]
[null,68,"System Sensor S/SC Strobe (110cd)",0,0.20200000000000001]
[null,69,"System Sensor S/SC Strobe (115cd)",0,0.21]
[null,70,"System Sensor S/SC Strobe (135cd)",0,0.22800000000000001]
[null,71,"System Sensor S/SC Strobe (150cd)",0,0.246]
[null,72,"System Sensor S/SC Strobe (177cd)",0,0.28100000000000003]
[null,73,"System Sensor S/SC Strobe (185cd)",0,0.28599999999999998]
[null,74,"System Sensor CHL Chime",0,1.4999999999999999E-2]
{"$rows_left_out":132}
{"sheet":"Circuit Config","index":2,"n_rows":69,"n_cols":8,"rows_kept":69,"cut":false,"hidden":false,"merged":[[61,1,62,1],[61,2,62,2],[61,5,61,6],[61,3,61,4],[42,4,42,6],[46,1,47,1],[46,2,47,2],[46,3,46,4],[46,5,46,6],[57,4,57,6],[16,1,17,1],[27,4,27,6],[31,1,32,1],[31,2,32,2],[31,3,31,4],[31,5,31,6],[1,2,3,2],[16,3,16,4],[16,5,16,6],[16,2,17,2],[12,4,12,6],[6,5,6,6],[8,5,8,6],[6,3,6,4],[8,3,8,4]]}
[]
[null,null,"Circuit Configuration"]
[]
[]
[]
[]
[null,"Project Name:",{"$f":"'Power Supply Config'!H4","v":0},"Project ID:",null,{"$f":"'Power Supply Config'!H6","v":0},{"$f":"'Power Supply Config'!J6","v":"Alarm Mins:"}]
[]
[null,"Prepared By:",{"$f":"'Power Supply Config'!H8","v":0},"Date:",null,{"$f":"'Power Supply Config'!H10","v":"00:00:00"},{"$f":"'Power Supply Config'!J10","v":"Voltage Drop Warning Threshold % :"}]
[]
[]
[]
[null,"Ckt. Number:",{"$f":"'Power Supply Config'!B48","v":"NAC #1"},"Panel ID:",{"$f":"'Power Supply Config'!$C$15","v":6808}]
[]
[null,"Ckt. Name:",{"$f":"'Power Supply Config'!C48:D48","v":"Notification Appl Circuit"},"Use:"]
[]
[null,"Qty","Device","Current Draw Each",null,"Current Draw Total"]
[null,null,null,"Standby","Alarm","Standby","Alarm"]
[null,null,{"$f":"VLOOKUP(H19,Smokes!$B$7:$E$168,2)","v":"Unused"},{"$f":"VLOOKUP(H19,Smokes!$B$7:$E$168,3)","v":0},{"$f":"VLOOKUP(H19,Smokes!$B$7:$E$168,4)","v":0},{"$f":"B19*D19","v":0},{"$f":"B19*E19","v":0},1]
[null,null,{"$f":"VLOOKUP(H20,Smokes!$B$7:$E$168,2)","v":"Unused"},{"$f":"VLOOKUP(H20,Smokes!$B$7:$E$168,3)","v":0},{"$f":"VLOOKUP(H20,Smokes!$B$7:$E$168,4)","v":0},{"$f":"B20*D20","v":0},{"$f":"B20*E20","v":0},1]
[null,null,{"$f":"VLOOKUP(H21,Smokes!$B$7:$E$168,2)","v":"Unused"},{"$f":"VLOOKUP(H21,Smokes!$B$7:$E$168,3)","v":0},{"$f":"VLOOKUP(H21,Smokes!$B$7:$E$168,4)","v":0},{"$f":"B21*D21","v":0},{"$f":"B21*E21","v":0},1]
[null,null,{"$f":"VLOOKUP(H22,Smokes!$B$7:$E$168,2)","v":"Unused"},{"$f":"VLOOKUP(H22,Smokes!$B$7:$E$168,3)","v":0},{"$f":"VLOOKUP(H22,Smokes!$B$7:$E$168,4)","v":0},{"$f":"B22*D22","v":0},{"$f":"B22*E22","v":0},1]
[null,null,null,null,null,{"$f":"B23*D23","v":0},{"$f":"B23*E23","v":0}]
[null,null,null,null,"Totals",{"$f":"SUM(F19:F23)","v":0},{"$f":"SUM(G19:G23)","v":0}]
[]
[]
[]
[null,"Ckt. Number:",{"$f":"'Power Supply Config'!B49","v":"NAC #2"},"Panel ID:",{"$f":"'Power Supply Config'!$C$15","v":6808}]
[]
[null,"Ckt. Name:",{"$f":"'Power Supply Config'!C49:D49","v":"Notification Appl Circuit"},"Use:"]
[]
[null,"Qty","Device","Current Draw Each",null,"Current Draw Total"]
[null,null,null,"Standby","Alarm","Standby","Alarm"]
[null,null,{"$f":"VLOOKUP(H34,Smokes!$B$7:$E$168,2)","v":"Unused"},{"$f":"VLOOKUP(H34,Smokes!$B$7:$E$168,3)","v":0},{"$f":"VLOOKUP(H34,Smokes!$B$7:$E$168,4)","v":0},{"$f":"B34*D34","v":0},{"$f":"B34*E34","v":0},1]
[null,null,{"$f":"VLOOKUP(H35,Smokes!$B$7:$E$168,2)","v":"Unused"},{"$f":"VLOOKUP(H35,Smokes!$B$7:$E$168,3)","v":0},{"$f":"VLOOKUP(H35,Smokes!$B$7:$E$168,4)","v":0},{"$f":"B35*D35","v":0},{"$f":"B35*E35","v":0},1]
[null,null,{"$f":"VLOOKUP(H36,Smokes!$B$7:$E$168,2)","v":"Unused"},{"$f":"VLOOKUP(H36,Smokes!$B$7:$E$168,3)","v":0},{"$f":"VLOOKUP(H36,Smokes!$B$7:$E$168,4)","v":0},{"$f":"B36*D36","v":0},{"$f":"B36*E36","v":0},1]
[null,null,{"$f":"VLOOKUP(H37,Smokes!$B$7:$E$168,2)","v":"Unused"},{"$f":"VLOOKUP(H37,Smokes!$B$7:$E$168,3)","v":0},{"$f":"VLOOKUP(H37,Smokes!$B$7:$E$168,4)","v":0},{"$f":"B37*D37","v":0},{"$f":"B37*E37","v":0},1]
[null,null,null,null,null,{"$f":"B38*D38","v":0},{"$f":"B38*E38","v":0}]
[null,null,null,null,"Totals",{"$f":"SUM(F34:F38)","v":0},{"$f":"SUM(G34:G38)","v":0}]
[]
[]
[]
[null,"Ckt. Number:",{"$f":"'Power Supply Config'!B50","v":"NAC #3"},"Panel ID:",{"$f":"'Power Supply Config'!$C$15","v":6808}]
[]
[null,"Ckt. Name:",{"$f":"'Power Supply Config'!C50:D50","v":"Notification Appl Circuit"},"Use:"]
[]
[null,"Qty","Device","Current Draw Each",null,"Current Draw Total"]
[null,null,null,"Standby","Alarm","Standby","Alarm"]
[null,null,{"$f":"VLOOKUP(H49,Smokes!$B$7:$E$168,2)","v":"Unused"},{"$f":"VLOOKUP(H49,Smokes!$B$7:$E$168,3)","v":0},{"$f":"VLOOKUP(H49,Smokes!$B$7:$E$168,4)","v":0},{"$f":"B49*D49","v":0},{"$f":"B49*E49","v":0},1]
[null,null,{"$f":"VLOOKUP(H50,Smokes!$B$7:$E$168,2)","v":"Unused"},{"$f":"VLOOKUP(H50,Smokes!$B$7:$E$168,3)","v":0},{"$f":"VLOOKUP(H50,Smokes!$B$7:$E$168,4)","v":0},{"$f":"B50*D50","v":0},{"$f":"B50*E50","v":0},1]
[null,null,{"$f":"VLOOKUP(H51,Smokes!$B$7:$E$168,2)","v":"Unused"},{"$f":"VLOOKUP(H51,Smokes!$B$7:$E$168,3)","v":0},{"$f":"VLOOKUP(H51,Smokes!$B$7:$E$168,4)","v":0},{"$f":"B51*D51","v":0},{"$f":"B51*E51","v":0},1]
[null,null,{"$f":"VLOOKUP(H52,Smokes!$B$7:$E$168,2)","v":"Unused"},{"$f":"VLOOKUP(H52,Smokes!$B$7:$E$168,3)","v":0},{"$f":"VLOOKUP(H52,Smokes!$B$7:$E$168,4)","v":0},{"$f":"B52*D52","v":0},{"$f":"B52*E52","v":0},1]
[null,null,null,null,null,{"$f":"B53*D53","v":0},{"$f":"B53*E53","v":0}]
[null,null,null,null,"Totals",{"$f":"SUM(F49:F53)","v":0},{"$f":"SUM(G49:G53)","v":0}]
[]
[]
[]
[null,"Ckt. Number:",{"$f":"'Power Supply Config'!B51","v":"NAC #4"},"Panel ID:",{"$f":"'Power Supply Config'!$C$15","v":6808}]
[]
[null,"Ckt. Name:",{"$f":"'Power Supply Config'!C51:D51","v":"Notification Appl Circuit"},"Use:"]
[]
[null,"Qty","Device","Current Draw Each",null,"Current Draw Total"]
[null,null,null,"Standby","Alarm","Standby","Alarm"]
[null,null,{"$f":"VLOOKUP(H64,Smokes!$B$7:$E$168,2)","v":"Unused"},{"$f":"VLOOKUP(H64,Smokes!$B$7:$E$168,3)","v":0},{"$f":"VLOOKUP(H64,Smokes!$B$7:$E$168,4)","v":0},{"$f":"B64*D64","v":0},{"$f":"B64*E64","v":0},1]
[null,null,{"$f":"VLOOKUP(H65,Smokes!$B$7:$E$168,2)","v":"Unused"},{"$f":"VLOOKUP(H65,Smokes!$B$7:$E$168,3)","v":0},{"$f":"VLOOKUP(H65,Smokes!$B$7:$E$168,4)","v":0},{"$f":"B65*D65","v":0},{"$f":"B65*E65","v":0},1]
[null,null,{"$f":"VLOOKUP(H66,Smokes!$B$7:$E$168,2)","v":"Unused"},{"$f":"VLOOKUP(H66,Smokes!$B$7:$E$168,3)","v":0},{"$f":"VLOOKUP(H66,Smokes!$B$7:$E$168,4)","v":0},{"$f":"B66*D66","v":0},{"$f":"B66*E66","v":0},1]
[null,null,{"$f":"VLOOKUP(H67,Smokes!$B$7:$E$168,2)","v":"Unused"},{"$f":"VLOOKUP(H67,Smokes!$B$7:$E$168,3)","v":0},{"$f":"VLOOKUP(H67,Smokes!$B$7:$E$168,4)","v":0},{"$f":"B67*D67","v":0},{"$f":"B67*E67","v":0},1]
[null,null,null,null,null,{"$f":"B68*D68","v":0},{"$f":"B68*E68","v":0}]
[null,null,null,null,"Totals",{"$f":"SUM(F64:F68)","v":0},{"$f":"SUM(G64:G68)","v":0}]

{"sheet":"Devices","index":3,"n_rows":156,"n_cols":5,"rows_kept":156,"cut":false,"hidden":true,"merged":[[4,3,4,4],[4,2,5,2],[4,1,5,1],[1,2,3,2]]}
[null,null,"Device Database"]
[null,null,"Notification Appliance Database"]
[]
[]
[null,"Item#","Device / Description","Current Draw In Amperes"]
[null,null,null,"Standby","Alarm"]
[null,1,"Unused"]
[null,2,"Gentex GMH-24-X Horn",0,3.7999999999999999E-2]
[null,3,"Gentex GX90-4 Horn",0,1.4999999999999999E-2]
[null,4,"Gentex GX90S-4-15 Horn",0,9.2999999999999999E-2]
[null,5,"Gentex GX90S-4-1575 Horn",0,0.108]
[null,6,"Gentex GXS-4-1575 Strobe",0,0.14499999999999999]
[null,7,"Gentex HG124 Horn",0,0.03]
[null,8,"Gentex HS24-110 Horn/Strobe",0,0.14000000000000001]
[null,9,"Gentex HS24-15 Horn/Strobe",0,7.6999999999999999E-2]
[null,10,"Gentex HS24-15/75 Horn/Strobe",0,8.6999999999999994E-2]
[null,11,"Gentex HS24-30 Horn/Strobe",0,8.6999999999999994E-2]
[null,12,"Gentex HS24-60 Horn/Strobe",0,0.114]
[null,13,"Gentex HS24-75 Horn/Strobe",0,0.11600000000000001]
[null,14,"Gentex SHG24-110 Horn/Strobe",0,0.25]
[null,15,"Gentex SHG24-15/75-C Horn/Strobe",0,0.123]
[null,16,"Gentex SHG24-15/75-W Horn/Strobe",0,0.123]
[null,17,"Gentex SHG24-15/75-Z Horn/Strobe",0,0.123]
[null,18,"Gentex SHG24-30 Horn/Strobe",0,0.123]
[null,19,"Gentex SHG24-30/75 Horn/Strobe",0,0.17199999999999999]
[null,20,"Gentex SHG24-60 Horn/Strobe",0,0.14499999999999999]
[null,21,"Gentex ST24-110 Strobe",0,0.11]
[null,22,"Gentex ST24-15 Strobe",0,4.7E-2]
[null,23,"Gentex ST24-15/75 Strobe",0,5.7000000000000002E-2]
[null,24,"Gentex ST24-30 Strobe",0,5.7000000000000002E-2]
[null,25,"Gentex ST24-60 Strobe",0,8.4000000000000005E-2]
[null,26,"Gentex ST24-75 Strobe",0,8.5999999999999993E-2]
[null,27,"Silent Knight end of line relay EOL-1224RLY",1.4999999999999999E-2,1.4999999999999999E-2]
[null,28,"System Sensor H12/24 Horn",0,2.5000000000000001E-2]
[null,29,"System Sensor P24110 Horn/Strobe",0,0.16500000000000001]
[null,30,"System Sensor P241575 Horn/Strobe",0,7.3999999999999996E-2]
[null,31,"System Sensor P2430 Horn/Strobe",0,9.1999999999999998E-2]
[null,32,"System Sensor P2475 Horn/Strobe",0,0.14799999999999999]
[null,33,"System Sensor S2415 Strobe",0,4.2999999999999997E-2]
[null,34,"System Sensor S241575 Strobe",0,4.9000000000000002E-2]
[null,35,"System Sensor S2430 Strobe",0,6.7000000000000004E-2]
[null,36,"System Sensor S2475 Strobe",0,0.123]
[null,37,"System Sensor SS24110 Strobe",0,0.14000000000000001]
[null,38,"Wheelock AMT-24-IS-VFR Strobe Horn",0,0.04]
[null,39,"Wheelock AMT-24-LSM-VFR Strobe Horn",0,0.125]
[null,40,"Wheelock AS-24110-HFR Strobe Horn",0,0.20200000000000001]
[null,41,"Wheelock AS-241575-VFR Strobe Horn",0,0.10199999999999999]
[null,42,"Wheelock AS-2415-VFR Strobe Horn",0,8.6999999999999994E-2]
[null,43,"Wheelock AS-2430-VFR Strobe Horn",0,0.13500000000000001]
[null,44,"Wheelock AS-2475-VFR Strobe Horn",0,0.156]
[null,45,"Wheelock MIZ-24-R Mini-Horn",0,1.2E-2]
[null,46,"Wheelock MIZ-24-W Mini-Horn",0,1.2E-2]
[null,47,"User Defined"]
[null,48,"User Defined"]
[null,49,"User Defined"]
[null,50,"User Defined"]
[null,51,"User Defined"]
[null,52,"User Defined"]
[null,53,"User Defined"]
[null,54,"User Defined"]
[null,55,"User Defined"]
[null,56,"User Defined"]
[null,57,"User Defined"]
[null,58,"User Defined"]
[null,59,"User Defined"]
[null,60,"User Defined"]
[null,61,"User Defined"]
[null,62,"User Defined"]
[null,63,"User Defined"]
[null,64,"User Defined"]
[null,65,"User Defined"]
[null,66,"User Defined"]
[null,67,"User Defined"]
[null,68,"User Defined"]
[null,69,"User Defined"]
[null,70,"User Defined"]
[null,71,"User Defined"]
[null,72,"User Defined"]
[null,73,"User Defined"]
[null,74,"User Defined"]
{"$rows_left_out":77}
{"sheet":"Data","index":4,"n_rows":35,"n_cols":9,"rows_kept":35,"cut":false,"hidden":true,"merged":[[0,0,0,3],[11,0,11,8],[6,2,6,3],[7,2,7,3],[8,2,8,3],[9,2,9,3],[2,2,2,3],[3,2,3,3],[4,2,4,3],[5,2,5,3]]}
["Conductor Properties NEC Chap. 9"]
["Item","Wire Type","Ohms Per 1000 ft."]
[1,"#12 Solid",1.59]
[2,"#12 Stranded",1.59]
[3,"#14 Solid",2.52]
[4,"#14 Stranded",2.52]
[5,"#16 Solid",4.0199999999999996]
[6,"#16 Stranded",4.0199999999999996]
[7,"#18 Solid",6.39]
[8,"#18 Stranded",6.39]
[]
["Cell Links For The Wire Type Drop Down Boxes Associated With Each 5395"]
[null,"5395(1)","5395(2)","5395(3)","5395(4)","5395(5)","5395(6)","5395(7)","5395(8)"]
[1,3,1,1,1,1,1,1,1]
[2,1,1,1,1,1,1,1,1]
[3,1,1,1,1,1,1,1,1]
[4,1,1,1,1,1,1,1,1]
[5,1,1,1,1,1,1,1,1]
[6,1,1,1,1,1,1,1,1]
[]
[]
[]
[1,"Notification Appl Circuit"]
[2,"Aux Power Circuit"]
[3,"Aux Power Circuit"]
[]
[]
[]
[]
[null,"I/O1",1]
[null,"I/O2",1]
[null,"I/O3",1]
[null,"I/O4",1]
[null,"I/O5",1]
[null,"I/O6",1]