{"text_format":"1","workbook":"xlsx","n_sheets":7,"sheets":["G702","G703","Instructions","Sprinks","Alarms","ChequeList","Notes"],"not_rendered":{"charts":0,"images":0,"macros":1,"external_links":0,"defined_names":9,"comments":5,"pivot_tables":0},"unopened":[],"bounds":{"document_bytes":16777216,"sheet_cells":100000,"rows_first":2000,"rows_last":500,"rows_between":2000,"halvings":0,"cell_chars":16384,"cell_head_chars":4096},"cells_cut":0,"cells_raw":0,"read":"whole","date_system":"1900"}

{"sheet":"G702","index":0,"n_rows":56,"n_cols":15,"rows_kept":56,"cut":false,"hidden":false,"merged":[[32,8,32,12],[24,6,25,7],[24,8,25,13]]}
["APPLICATION AND CERTIFICATION FOR PAYMENT",null,null,null,null,null,"AIA DOCUMENT G702",null,null," "," ",null,"Rev: ","2019-02-10"]
[]
["TO CONTRACTOR:",null,null,"PROJECT:","La Caille Phase I",null,null,"APPLICATION NO:",0,null,"Distribution to:"]
[]
[null,null,"Milestone",null,"9565 South Wasatch Blvd",null,null,null,null,null,null,"OWNER"]
[]
[null,null,"1883 E 9400 S",null,"Sandy UT 84092-6009",null,null,"APPLICATION DATE:","2020-12-01",null,null,"ARCHITECT"]
[]
[null,null,"Sandy UT 84093",null,null,null,null,"PERIOD ENDNG:",{"$f":"+I7","v":"2020-12-01"},null,null,"CONTRACTOR"]
[]
["FROM SUBCONTRACTOR:",null,null,"VIA ARCHITECT:","Lu'na"]
[]
[null,null,"Fire Suppression Services Incorporated",null,"175 W 200 E #2020",null,null,"Contract Date","2020-11-01"]
[]
[null,null,"3802 South 2300 East",null,"SLC UT 84101",null,null,"Start Date","2020-12-10"]
[null,null,"Milcreek UT 84109",null,"(801) 350-2046",null,null,"CONTRACT NUMBER:","20YY-####"]
["CONTRACT FOR: ",null,"Div-21 Fire Suppression -Sprinklers",null,null,null,null,"Invoice Number",null,"Need number"]
[]
["CONTRACTOR'S APPLICATION FOR PAYMENT",null,null,null,null,null,"The undersigned Subcontractor certifies that to the best of the Subcontractor's knowledge, "]
["Application is made for payment, as shown below, in connection with the Contract.",null,null,null,null,null,"information and belief the Work covered by this Application for Payment has been"]
["Continuation Sheet, AIA Document G703, is attached.",null,null,null,null,null,"completed in accordance with the Subcontract Documents, that all amounts have been paid by "]
[" ",null,null,null,null,null,"the Subcontractor for Work for which previous Certificates for Payment were issued and "]
[" ",null,null,null,null,null,"payments received from the Contractor, and that current payment shown herein is now due."]
[]
["1.  ORIGINAL CONTRACT SUM ",null,null," $",{"$f":"4000+1500","v":5500},null,"Subcontractor:",null,"Fire Suppression Services Incorporated"]
["2.  Net change by Change Orders ",null,null," $",{"$f":"+D53","v":0}]
["3.  CONTRACT SUM TO DATE (Line 1 ± 2)                                        $",null,null,"$",{"$f":"SUM(E25:E26)","v":5500}]
["4.  TOTAL COMPLETED & STORED TO",null,null,"$",{"$f":"'G703'!K91","v":0},null,"By:",null,null,null," Date:"]
["         DATE       (Column G on G703)",null,null,null,null,null,"State of: ",null,null,"County of: "]
["5.  RETAINAGE:",null,null,null,null,null,"Subscribed and sworn to before me this ___________ day of  ___________ 2015"]
["a.",0," of Completed Work",{"$f":"'G703'!H94+'G703'!I94","v":0},{"$f":"+D31*B31","v":0}]
[null,"(Column D + E on G703)",null,null,null,null,"Notary Public:  _______________________________________________________________"]
["b.",0.05," of Stored Material",{"$f":"'G703'!J94","v":0},{"$f":"+D33*B33","v":0}]
[null,"(Column F on G703)"]
["           Total Retainage (Lines 5a + 5b or",null,null,null,{"$f":"+E31+E33","v":0},null,"My Commission expires:"]
[null,"Total in Column I of G703) ",null,"$",{"$f":"'G703'!N91","v":0},null,"CONTRACTORS CERTIFICATE FOR PAYMENT"]
["6.  TOTAL EARNED LESS RETAINAGE ",null,null,"$",{"$f":"IF(E36<E35,E28-E36,E28-E35)","v":0},null,"In accordance with the Contract Documents, based on on-site observations and the data"]
[null,"(Line 4 Less Line 5 Total)",null,null,null,null,"comprising the application, the Contractor certifies to the Owner that to the best of  the"]
["7.  LESS PREVIOUS CERTIFICATES FOR",null,null,null,null,null,"Contractor's knowledge, information and belief the Work has progressed as indicated,"]
["     PAYMENT (Line 6 from prior Certificate) ",null,null,"$",null,null,"the quality of the Work is in accordance with the Contract Documents, and the Subcontractor"]
{"$rows_left_out":17}
{"sheet":"G703","index":1,"n_rows":112,"n_cols":15,"rows_kept":112,"cut":false,"hidden":false,"merged":[]}
[null,"CONTINUATION SHEET",null,null,null,null,null,null,"AIA DOCUMENT G703"]
[]
[null,"AIA Document G702, APPLICATION AND CERTIFICATION FOR PAYMENT, containing",null,null,null,null,null,null,null,null,null,"APPLICATION NO:",{"$f":"'G702'!I3","v":0}]
[null,"Contractor's signed certification is attached.",null,null,null,null,null,null,"Bid Date:","2019-02-01",null,"APPLICATION DATE:",{"$f":"'G702'!I7","v":"2020-12-01"}]
[null,"In tabulations below, amounts are stated to the nearest dollar.",null,null,null,null,null,null,"Contract Date:",{"$f":"+'G702'!I13","v":"2020-11-01"},null,"PERIOD ENDING:",{"$f":"'G702'!I9","v":"2020-12-01"}]
[null,"Use Column I on Contracts where variable retainage for line items may apply.",null,null,null,null,{"$f":"+'G702'!B31","v":0},null,"Start Date:",{"$f":"+'G702'!I15","v":"2020-12-10"},null,"CONTRACT NUMBER:",{"$f":"'G702'!I16","v":"20YY-####"}]
[null,null,null,null,null,null,null,null,"End Date:",{"$f":"+J6+25","v":"2021-01-04"},null,"INVOICE#:",{"$f":"+'G702'!I17","v":0}]
[null,"A","B",null,null,null,"C","D","E","F","G",null,"H","I"]
[null,"ITEM","DESCRIPTION OF WORK",null,null,null,"SCHEDULED","WORK COMPLETED",null,"MATERIALS","TOTAL","%","BALANCE","RETAINAGE"]
[null,"NO.",{"$f":"IF('G702'!I17<1,\"see G702 Invoice number\",\"Inv#: \" &'G702'!I17)","v":"see G702 Invoice number"},null,null,null,"VALUE","FROM PREVIOUS","THIS PERIOD","PRESENTLY","COMPLETED","(G ÷ C)","TO FINISH","(IF VARIABLE"]
[null,null,null,null,null,null,null,"APPLICATION",null,"STORED","AND STORED",null,"(C - G)","RATE)"]
[null,null,null,null,null,null,null,"(D + E)",null,"(NOT IN","TO DATE"]
[null,null,null,null,null,null,null,null,null,"D OR E)","(D+E+F)"]
[null,{"$f":"+B13+1","v":1},"PRELIMINARYS"]
[null,{"$f":"+B14+1","v":2},null,"Bond",null,null,0,0,0,null,{"$f":"H15+I15+J15","v":0},{"$f":"IF(G15>0,K15/G15,0)","v":0},{"$f":"G15-K15","v":0},0,"No Retention"]
[null,{"$f":"+B15+1","v":3},null,"Design",null,null,{"$f":"2000+385+500","v":2885},0,0,null,{"$f":"H16+I16+J16","v":0},{"$f":"IF(G16>0,K16/G16,0)","v":0},{"$f":"G16-K16","v":2885},0,"No Retention"]
[null,4,null,"Submit",null,null,165,0,0,null,{"$f":"H17+I17+J17","v":0},0,{"$f":"G17-K17","v":165},0,"No Retention"]
[null,5,null,"Permit",null,null,200,0,0,null,{"$f":"H18+I18+J18","v":0},0,{"$f":"G18-K18","v":200},0,"No Retention"]
[null,6]
[null,7,null,"Printing / Drawings"]
[null,8,null,null,"Design-Submit stage",null,165,0,null,null,{"$f":"H21+I21+J21","v":0},{"$f":"IF(G21>0,K21/G21,0)","v":0},{"$f":"G21-K21","v":165},{"$f":"K21*$G$6","v":0}]
[null,9]
[null,10]
[null,11,"MOVEMENT"]
[null,12,null,"Mobilisation",null,null,0,0,0,null,{"$f":"H25+I25+J25","v":0},{"$f":"IF(G25>0,K25/G25,0)","v":0},{"$f":"G25-K25","v":0},{"$f":"K25*$G$6","v":0}]
[null,13,null,"Travel & Transport",null,null,0,0,0,null,0,0,0,0]
[null,14,null,"AWP",null,null,0,0,0,null,{"$f":"H27+I27+J27","v":0},{"$f":"IF(G27>0,K27/G27,0)","v":0},{"$f":"G27-K27","v":0},0]
[null,15,null,"Freight & Fuel",null,null,0,0,0,null,0,0,0,0]
[null,16,null,"Accommodation"]
[null,17,null,"DeMobilisation","see Finals section below"]
[null,18]
[null,19]
[null,20,"PARTS & MATERIALS"]
[null,21,null,"Riser"]
[null,22,null,null,"Parts",null,0,0,0,null,{"$f":"H35+I35+J35","v":0},{"$f":"IF(G35>0,K35/G35,0)","v":0},{"$f":"G35-K35","v":0},{"$f":"K35*$G$6","v":0}]
[null,23,null,null,"Dry + Trimmer",null,0,0,0,null,0,0,0,0]
[null,24,null,null,"Compressor-Riser Mount +AMD",null,0,0,0,null,0,0,0,0]
[null,25,null,null,"Head Box & Head Wrench",null,0,0,0,null,0,0,0,0]
[null,26,null,null,"BFP Strobe",null,0,0,0,null,0,0,0,0]
[null,27,null,"FDC"]
{"$rows_left_out":73}
{"sheet":"Instructions","index":2,"n_rows":186,"n_cols":12,"rows_kept":186,"cut":false,"hidden":false,"merged":[]}
[null,null,null,null,null,null,null,"Note: This Workbook is Macro-Enabled"]
["INSTRUCTIONS for:"]
[null,"The G702 -Application & Certification for Payment & the G703 Continuation Sheet."]
[null,null,null,null,null,null,null,null,null,null,null,"Fire Suppression Services Incorporated"]
["Create a NEW file each month. (Copy this file to the General's Job-Payments Folder) and name it in format   yyyy-mm-dd Schedule of Values.xlsx"]
["Click 'View-ArrangeAll-select horizontal-Ok'  to see the sheet tabs at the bottom of the workbook."]
[null,"or if macros are disabled, The Security Warning: Macros have been disabled, above appears, click options and enable this Content"]
[null,null,null,null,null,null,null,null,"and we will resize the form for you."]
["Yellow = HiLite  Don't touch!   ,  Buff or Blue: You fill in data",null,null,null,null,"Grayed columns are where $retain calcs occur"]
[]
["G702"]
[null,"Fill in the G702  Application & Certification for Payment",null,null,null,null,null,null,null,null,null,"First page"]
[null,"TO:  Contractor (General's) Name and Address"]
[null,"Project name",null,null,"Architects Name Address"]
[null,"Application date"]
[null,"Period:   the dates this application covers"]
[null,"Contract number (off your Contract document)"]
[null,"Place an 'Tick' in the appropriate 'Distribution To' box"]
[null,"FROM:  Your Company name should be in to the 'From subcontractor'"]
[]
[null,"In the 'Contractor's Application for Payment' section,"]
[]
[]
[null,"LINE 1.","Fill in the sum from the ORIGINAL contract document.  It NEVER changes, from Start to End of the Contract term."]
[null,"LINE 2.","Net Change by Change Orders.  Add up in your head all the CCO's that have been APPROVED by the General"]
[null,null,"and enter the total here.",null,null,null,null,null,null,null,null,"2016-Dec  it now comes from D53 [NET CHANGES by Change Order]"]
[null,"LINE 3.","Contract Sum to Date, will total automatically"]
[null,"LINE 4.","Total Completed & Stored comes from the left side of column G on the G703"]
[null,"LINE 5.","Retainage"]
[null,null,"Your contract should set the retention terms, if any. (often it is 5%)"]
[null,null,null,"FSSI never accepts retention on Bonds, Design or Permitting"]
[null,null,null,"If we are required to underwrite a Bond/s for the GC or Owner, No Retention on any item."]
[null,null,null,null,"Bond is a 'Money-Back' guarantee. There is no need to also have retention."]
[null,null,null,null,"Bond/s serve same purpose as retention"]
[null,null,null,"If it's 5% for both, enter % in appropriate slot."]
[null,null,null,null,"5a","Completed  work.  Enter the appropriate %. "]
[null,null,null,null,null,null,"Amounts to the right are calculated from bottom of"]
[null,null,null,null,null,null,"column D + E on the G703",null,null,null,null,"CHECK with GENERAL, they may not"]
[null,null,null,null,"5b","Stored materials..  Enter the appropriate %",null,null,null,null,null,"      allow STORED Materials"]
[null,null,null,null,null,null,"Amounts to the right are calculated from bottom of"]
{"$rows_left_out":147}
{"sheet":"Sprinks","index":3,"n_rows":76,"n_cols":10,"rows_kept":76,"cut":false,"hidden":false,"merged":[]}
["Sprinks"]
[null,"INCOMPLETE - WORK IN-PROGRESS TO EDIT ARUN"]
[]
[]
[null,null,null,"Enter Sq Foot",null,1.85,null,null,null,"Notes"]
[]
[null,null,"Ground",10848]
[null,null,"Attic",11704]
[null,null,"Area A",0]
[null,null,"Area B"]
[null,null,null,0,null,null,null,null,null,"<- Insert additional rows here if required"]
[]
[null,null,"Total",22552,null,41721.199999999997,null,null,null,"<-- Price should be near this"]
[]
[null,null,null,"Enter",null,"Enter Price","Don't touch",null,"Cost"]
[null,null,null,"Unit/s","Desc","each","extension",null,"Price","Notes"]
[]
[]
[null,null,null,22552,"Design",0.16,3608.32,null,0.13]
[null,null,null,1,"Submit",150,150]
[null,null,null,1,"Permit",1000,1000]
[]
[null,null,"Printing Drawings -Design-Submit stage",null,"Printing Drawings -Design-Submit stage"]
[]
[null,null,"Mobilisation",1,"Mobilisation",500,{"$f":"+D25*F25","v":500},null,null,"Mobilization, DeMob, ReMobilization"]
[]
[]
[null,null,"Riser",null,"Riser"]
[null,null,"Wet",1,"Transport",1000,1000]
[null,null,"Dry + Trimmer",1,"Drawings",150,150,null,null,"Prices for AWP's"]
[null,null,"Compressor-Riser Mount +AMD",1,"FDC",1500,1500,null,null,"Price for FDC"]
[null,null,"Head Box & Head Wrench",1,"Riser Assmbly",1860,1860]
[null,null,"FDC-BFP Strobe",1,"dry vlv, ac,  amd",5000,5000,null,null,"ENTER DATA ONLY IN the CYAN cells"]
[null,null,null,1,"Attic",5000,5000]
[null,null,"Ground Floor",1,"main floor",4000,4000]
[null,null,"Material",1,"Compressor",1800,1800]
[null,null,"Labour",null,"DeMob",null,0]
[null,null,"Fabrication",null,null,null,0,null,null,"<- Insert additional rows here if required"]
[null,null,"Attic",1,"Freight",1000,1000]
[null,null,"Material","Insert rows ABOVE here where needed"]
{"$rows_left_out":37}
{"sheet":"Alarms","index":4,"n_rows":42,"n_cols":28,"rows_kept":42,"cut":false,"hidden":false,"merged":[]}
[{"$f":"+'G702'!E3","v":"La Caille Phase I"},null,null,null,null,null,null,null,null,null,null,null,null,null,"Legal Services",null,null,null,null,null,null,null,"Testing",null,null,"Printing","Admin"]
[null,null,null,"Description",null,null,null,null,null,"Unit P","Extension","Design","Submit","Permit","Lien",null,"Parts","Pull","FACP","MDM","Labour",null,"Insp.Trip","Finals","Training","O&M's","PM","Freight"]
[]
[null,null,null,"Bond",null,null,null,null,null,0,{"$f":"+C4*J4","v":0}]
[null,null,1,"Design",null,null,null,null,null,450,450,{"$f":"+K5","v":450}]
[null,null,1,"Submit",null,null,null,null,null,200,200,null,{"$f":"+K6","v":200}]
[null,null,1,"Permit",null,null,null,null,null,125,125,null,null,{"$f":"+K7","v":125}]
[null,null,1,"Mobilization",null,null,null,null,null,75,75,null,null,null,null,null,null,null,null,{"$f":"+K8","v":75}]
[null,null,null,"Legal",null,null,null,null,null,15,0,null,null,null,{"$f":"+K9","v":0}]
[null,null,9,"Horns & Strobes",null,null,null,null,null,47,423,null,null,null,null,null,{"$f":"+K10","v":423}]
[null,null,1,"Horn/Strobe Weatherproof",null,null,null,null,null,105,105,null,null,null,null,null,{"$f":"+K11","v":105}]
[null,null,3,"Strobes",null,null,null,null,null,41,123,null,null,null,null,null,{"$f":"+K12","v":123}]
[null,null,19,"Addressable Smoke Detectors-Sounder Bases",null,null,null,null,null,68,1292,null,null,null,null,null,{"$f":"+K13","v":1292}]
[null,null,1,"VS1 Fire Panel (xx-zone)",null,null,null,null,null,525,525,null,null,null,null,null,null,null,{"$f":"+K14","v":525}]
[null,null,4,"CT1 Alarm contacts for riser",null,null,null,null,null,42,168,null,null,null,null,null,{"$f":"+K15","v":168}]
[null,null,4,"Pull Station",null,null,null,null,null,52,208,null,null,null,null,null,null,{"$f":"+K16","v":208}]
[null,null,2,"Control Relays & Modules",null,null,null,null,null,55,110,null,null,null,null,null,null,null,{"$f":"+K17","v":110}]
[null,null,2,"Monitor Modules",null,null,null,null,null,60,120,null,null,null,null,null,null,null,{"$f":"+K18","v":120}]
[null,null,null,"Booster Power Power Supplies",null,null,null,null,null,1800,0]
[null,null,null,"Adapter -Class A",null,null,null,null,null,68,0]
[null,null,2,"Wire -Fire 14/2",null,null,null,null,null,350,700,null,null,null,null,null,{"$f":"+K21","v":700}]
[null,null,1,"Parts & Accessories, back-boxes etc.",null,null,null,null,null,500,500,null,null,null,null,null,{"$f":"+K22","v":500}]
[null,null,1,"Panel Programming",null,null,null,null,null,75,75,null,null,null,null,null,null,null,null,null,null,null,{"$f":"+K23","v":75}]
[null,null,1,"Freight",null,null,null,null,null,50,50,null,null,null,null,null,null,null,null,null,null,null,null,null,null,null,null,{"$f":"+K24","v":50}]
[null,null,null,"Labour Description","Hours",null,"days",null,"Total Hours"]
[null,null,3,"     Labor Techs at",8,"hours over",5,null,{"$f":"+C26*E26*G26","v":120},70,{"$f":"+I26*J26","v":8400},null,null,null,null,null,null,null,null,null,{"$f":"+K26","v":8400}]
[null,null,null,"Finals"]
[null,null,1,"    Testing & Inspections Trip Test",null,null,null,null,null,150,{"$f":"+C28*J28","v":150},null,null,null,null,null,null,null,null,null,null,null,{"$f":"+K28","v":150}]
[null,null,1,"    De-Mob",null,null,null,null,null,75,{"$f":"+C29*J29","v":75},null,null,null,null,null,null,null,null,{"$f":"+K29","v":75}]
[null,null,1,"    Printing As-Builts, Manuals. Tags RedLines",null,null,null,null,null,150,{"$f":"+C30*J30","v":150},null,null,null,null,null,null,null,null,null,null,null,null,null,null,{"$f":"+K30","v":150}]
[null,null,null,"Legal",null,null,null,null,null,15,{"$f":"+C31*J31","v":0},null,null,null,{"$f":"+K31","v":0}]
[null,null,null,"Description","Hours",null,"days",null,"Total Hours"]
[null,null,1,"    Training",1,"hours over",1,null,{"$f":"+C33*E33*G33","v":1},75,{"$f":"+I33*J33","v":75},null,null,null,null,null,null,null,null,null,null,null,null,null,{"$f":"+K33","v":75}]
[null,null,1,"    Project Management",0.25,null,5,null,{"$f":"+C34*E34*G34","v":1.25},75,{"$f":"+I34*J34","v":93.75},null,null,null,null,null,null,null,null,null,null,null,null,null,null,null,{"$f":"+K34","v":93.75}]
[null,null,null,null,null,null,null,null,null,0,0]
[null,null,1,"Fudge",null,null,null,null,2.25,0,{"$f":"+C36*I36","v":2.25},null,null,null,null,null,null,2,null,null,null,null,null,null,null,null,0.25]
[]
[null,null,null,null,null,null,null,null,null,null,{"$f":"SUM(K3:K37)","v":14195},{"$f":"SUM(L3:L37)","v":450},{"$f":"SUM(M3:M37)","v":200},{"$f":"SUM(N3:N37)","v":125},{"$f":"SUM(O3:O37)","v":0},null,{"$f":"SUM(Q3:Q37)","v":3311},{"$f":"SUM(R3:R37)","v":210},{"$f":"SUM(S3:S37)","v":755},{"$f":"SUM(T3:T37)","v":150},{"$f":"SUM(U3:U37)","v":8400},null,{"$f":"SUM(W3:W37)","v":225},{"$f":"SUM(X3:X37)","v":0},{"$f":"SUM(Y3:Y37)","v":75},{"$f":"SUM(Z3:Z37)","v":150},{"$f":"SUM(AA3:AA37)","v":94},50]
[null,null,null,null,null,null,null,null,null,null,{"$f":"SUM(L38:AB38)","v":14195},{"$f":"+L2","v":"Design"},{"$f":"+M2","v":"Submit"},{"$f":"+N2","v":"Permit"},{"$f":"+O2","v":"Lien"},null,"Parts","Pull","FACP","MDM","Labour",null,"Insp.Trip","Finals","Training","O&M's",{"$f":"+AA2","v":"PM"},"Freight"]
[]
{"$rows_left_out":3}
{"sheet":"ChequeList","index":5,"n_rows":169,"n_cols":21,"rows_kept":169,"cut":false,"hidden":false,"merged":[]}
[null,null,"1 = Design, 2 = Permit Submit",null,null,"START Date:-->",null,{"$f":"+'G703'!J6","v":"2020-12-10"},"2019-01-20","<--Enter Start of App Period"]
[null,null,"3 = Parts,  4 = Fabrication, 5 = Travel Transport AWP"]
[]
[null,null,null,null,null,null,null,"G702",{"$f":"SUM(I6:I167)","v":0},{"$f":"SUM(J6:J167)","v":0},0,0,0,0,0,0,0,0,null,null,"G702/$Net"]
[null,"Cheques to receive as @",null,{"$f":"NOW()","v":"2020-12-15T15:23:50.540"},"PAID","Date Rec'd","Chk #","App-#",{"$f":"+C7","v":"01 Design FSS"},{"$f":"+C8","v":"01 Design SFPS"},{"$f":"+C9","v":"02 Permit Submit AHJ"},{"$f":"+C10","v":"03 Parts FFab"},{"$f":"+C11","v":"03 Parts HD Supply"},{"$f":"+C12","v":"04 FabAFS"},{"$f":"+C13","v":"04 Fab Driller"},{"$f":"+C14","v":"05 AWP Howe"},{"$f":"+C15","v":"05 AWP FSS Fork Lift"},{"$f":"+C16","v":"Other"},null,{"$f":"+C18","v":"FSS"},"Gross"]
[null,null,null,null,null,null,null,1]
[{"$f":"+A5+1","v":1},null,"01 Design FSS",null,null,null,null,null,{"$f":"+E7","v":0}]
[{"$f":"+A7+1","v":2},null,"01 Design SFPS",null,null,null,null,null,null,{"$f":"+E8","v":0}]
[3,null,"02 Permit Submit AHJ",null,null,null,null,null,null,null,{"$f":"+E9","v":0}]
[4,null,"03 Parts FFab",null,null,null,null,null,null,null,null,{"$f":"+E10","v":0}]
[5,null,"03 Parts HD Supply",null,null,null,null,null,null,null,null,null,{"$f":"+E11","v":0}]
[6,null,"04 FabAFS",null,null,null,null,null,null,null,null,null,null,{"$f":"+E12","v":0}]
[7,null,"04 Fab Driller",null,null,null,null,null,null,null,null,null,null,null,{"$f":"+E13","v":0}]
[8,null,"05 AWP Howe",null,null,null,null,null,null,null,null,null,null,null,null,{"$f":"+E14","v":0}]
[9,null,"05 AWP FSS Fork Lift",null,null,null,null,null,null,null,null,null,null,null,null,null,{"$f":"+E15","v":0}]
[10,null,"Other",null,null,null,null,null,null,null,null,null,null,null,null,null,null,{"$f":"+E16","v":0}]
[11]
[12,null,"FSS",{"$f":"\"Period end:  \"  & TEXT((EDATE($H$1,0)),\"mmm\")&\" \"","v":"Period end:  Dec "},{"$f":"+U18-SUM(E6:E17)","v":0},null,null,{"$f":"+H6","v":1},null,null,null,null,null,null,null,null,null,null,null,{"$f":"+E18","v":0}]
[]
[{"$f":"+A18+1","v":13},null,{"$f":"+C7","v":"01 Design FSS"},null,null,null,null,null,{"$f":"+E20","v":0}]
[14,null,"01 Design SFPS",null,null,null,null,null,null,{"$f":"+E21","v":0}]
[15,null,"02 Permit Submit AHJ",null,null,null,null,null,null,null,{"$f":"+E22","v":0}]
[16,null,"03 Parts FFab",null,null,null,null,null,null,null,null,{"$f":"+E23","v":0}]
[17,null,"03 Parts HD Supply",null,null,null,null,null,null,null,null,null,{"$f":"+E24","v":0}]
[18,null,"04 FabAFS",null,null,null,null,null,null,null,null,null,null,{"$f":"+E25","v":0}]
[19,null,"04 Fab Driller",null,null,null,null,null,null,null,null,null,null,null,{"$f":"+E26","v":0}]
[20,null,"05 AWP Howe",null,null,null,null,null,null,null,null,null,null,null,null,{"$f":"+E27","v":0}]
[21,null,"05 AWP FSS Fork Lift",null,null,null,null,null,null,null,null,null,null,null,null,null,{"$f":"+E28","v":0}]
[22,null,"Other",null,null,null,null,null,null,null,null,null,null,null,null,null,null,{"$f":"+E29","v":0}]
[23]
[24,null,{"$f":"+C18","v":"FSS"},{"$f":"\"Period end:  \"  & TEXT((EDATE($H$1,1)),\"mmm\")&\" \"","v":"Period end:  Jan "},{"$f":"+U31-SUM(E19:E30)","v":0},null,null,{"$f":"+H18+1","v":2},null,null,null,null,null,null,null,null,null,null,null,{"$f":"+E31","v":0}]
[25]
[26,null,{"$f":"+C20","v":"01 Design FSS"},null,null,null,null,null,{"$f":"+E33","v":0}]
[27,null,"01 Design SFPS",null,null,null,null,null,null,{"$f":"+E34","v":0}]
[28,null,"02 Permit Submit AHJ",null,null,null,null,null,null,null,{"$f":"+E35","v":0}]
[29,null,"03 Parts FFab",null,null,null,null,null,null,null,null,{"$f":"+E36","v":0}]
[30,null,"03 Parts HD Supply",null,null,null,null,null,null,null,null,null,{"$f":"+E37","v":0}]
[31,null,"04 FabAFS",null,null,null,null,null,null,null,null,null,null,{"$f":"+E38","v":0}]
[32,null,"04 Fab Driller",null,null,null,null,null,null,null,null,null,null,null,{"$f":"+E39","v":0}]
[33,null,"05 AWP Howe",null,null,null,null,null,null,null,null,null,null,null,null,{"$f":"+E40","v":0}]
{"$rows_left_out":130}
{"sheet":"Notes","index":6,"n_rows":20,"n_cols":8,"rows_kept":20,"cut":false,"hidden":false,"merged":[]}
[]
[]
[]
[]
[]
[null,null,"2017-09-22","Added invoice color if blank"]
[]
[null,null,"2016-12-05","Added Orange Bar to ChequeList"]
[]
[null,null,null,"Requires Edate from Analysis ToolPak"]
[]
[null,null,"2016-08-22","2016-08-22 Needs Costing Sheets"]
[null,null,null,"remove Sprinks & Alarms ???"]
[]
[]
[null,null,null,null,null,null,null,"Column1"]
[null,null,null,null,null,null,null,"Div-10 44 16 Fire Extinguisher Cabinets or Extinguishers"]
[null,null,null,null,null,null,null,"Div-10 Fire Suppression Chemical -Clean Agent"]
[null,null,null,null,null,null,null,"Div-10 Fire Suppression Chemical-Kitchen Hoods"]
[null,null,null,null,null,null,null,"Div-21 Fire Suppression -Sprinklers"]