{"text_format":"1","workbook":"xlsx","n_sheets":4,"sheets":["Sheet1","Sheet2","Sheet3","Notes"],"not_rendered":{"charts":0,"images":3,"macros":1,"external_links":1,"defined_names":1,"comments":0,"pivot_tables":0},"unopened":[],"bounds":{"document_bytes":16777216,"sheet_cells":100000,"rows_first":2000,"rows_last":500,"rows_between":2000,"halvings":0,"cell_chars":16384,"cell_head_chars":4096},"cells_cut":0,"cells_raw":0,"read":"whole","date_system":"1900"}

{"sheet":"Sheet1","index":0,"n_rows":44,"n_cols":4,"rows_kept":44,"cut":false,"hidden":false,"merged":[[2,0,2,4]]}
["JOBSHEET"]
[]
["¢ PLEASE E-MAIL A COPY OF THE FRONT PAGE OF YOUR CONTRACT FOR THIS JOB."]
["¢ IF A PUBLIC OR FEDERAL ENTITY IS LISTED AS THE OWNER, PLEASE E-MAIL A COPY OF THE PAYMENT BOND."]
["¢ E-MAILING A COPY OF THE PAYMENT BOND AND A COPY OF THE FRONT PAGE OF YOUR CONTRACT WILL PROTECT BOTH FERGUSON AND YOU."]
["¢E-MAIL THIS JOBSHEET TO: ","veronica.paz@Ferguson.com"]
["âFERGUSON'S CUSTOMER","Fire Suppression Services Incorporated","âNAME OF JOB","La Caille"]
["MAIN CUSTOMER NUMBER",376,"CUSTOMER'S JOB NUMBER","LACAI"]
["CUSTOMER'S STREET ADDRESS","3802 South 2300 East","â APN NUMBER OR AIN NUMBER"]
["CITY","Salt Lake City","TRACK & LOT NUMBERS"]
["STATE (2 LETTER ABREV.)","UT","âJOB ADDRESS LINE 1","9565 South Wasatch Boulevard"]
["ZIP CODE","84109-3421","JOB ADDRESS LINE 2"]
[null,null,"JOB ADDRESS LINE 3"]
["âGENERAL CONTRACTOR","FSS","CITY","Sandy"]
["GENERAL'S ADDRESS","3802 South 2300 East","STATE (2 LETTER ABREV.)","UT"]
["CITY","Millcreek","ZIP CODE",84092]
["STATE (2 LETTER ABREV.)","UT","JOBSITE CONTACT & PHONE NUMBER"]
["ZIP CODE",84109]
["PHONE",8012776464,"âESTIMATED MATERIAL AMOUNT $",6000]
["FAX",null,"IS THIS A PUBLIC WORKS JOB ?","No"]
[null,null,"COMMERCIAL, OR RESIDENTIAL JOB ?","Commercial"]
["âSURETY FOR BOND ","Old Republic Surety Company","IS THIS JOB TAX EXEMPT ? ","No"]
["SURETY MAILING ADDRESS","P.O. Box 1635","âPROPERTY OWNER","HOLLADAY 2550 LLC"]
["CITY","Milwaukee","OWNER'S ADDRESS","9565 S WASATCH BLVD"]
["STATE (2 LETTER ABREV.)","WI","CITY","Sandy"]
["ZIP CODE",5320,"STATE (2 LETTER ABREV.)","UT"]
["PHONE",8013521161,"ZIP CODE",84092]
["âPAYMENT BOND NUMBER","N/A","PHONE",8019421751]
[]
["IF YOU ARE A SUB OF A SUB, LIST THE SUBCONTRACTOR'S NAME AND ADDRESS BELOW:",null,"âBANK FINANCING THIS JOB ","Fire Suppression Services Inc."]
["âSUBCONTRACTOR",null,"BANK'S ADDRESS"]
["SUBCONTRACTOR'S ADDRESS",null,"CITY"]
["CITY",null,"STATE (2 LETTER ABREV.)"]
["STATE ",null,"ZIP CODE"]
["ZIP CODE"]
["PHONE"]
[]
["CREDIT DEPARTMENT USE ONLY BELOW THIS LINE"]
["BID #",null,"1ST SHIP DATE"]
["SURETY AM BEST RATING",null,"SALESMAN"]
["JOB ACCOUNT #",null,"BICA MEMBER #"]
[]
["Revised May, 2009"]
["Mods: 2014-04-01 Arun"]

{"sheet":"Sheet2","index":1,"n_rows":127,"n_cols":10,"rows_kept":127,"cut":false,"hidden":false,"merged":[]}
["CREDIT DEPARTMENT USE ONLY"]
["ver: 2014-04-02"]
["Copy and paste the highlighted cells (light green) below into Trilogie in order to submit this jobsheet."]
["CFM"]
["NEW"]
["Y"]
[{"$f":"INDIRECT(D7)","v":376},null,null,"Sheet1!B8",null,"CUST #"]
[{"$f":"IF((INDIRECT(D8))=\"\",\".\",(UPPER(INDIRECT(D8))))","v":"LA CAILLE"},null,null,"Sheet1!D7",null,"JOB NAME"]
["US",null,null,null,null,"JOB COUNTRY"]
[{"$f":"IF((INDIRECT(D10))=\"\",\".\",UPPER(INDIRECT(D10)))","v":"9565 SOUTH WASATCH BOULEVARD"},null,null,"Sheet1!D11",null,"JOB ADDRESS"]
[{"$f":"IF((INDIRECT(D11))=\"\",\".\",UPPER(INDIRECT(D11)))","v":"."},null,null,"Sheet1!D12"]
[{"$f":"IF((INDIRECT(D12))=\"\",\".\",UPPER(INDIRECT(D12)))","v":"."},null,null,"Sheet1!D13"]
[{"$f":"IF((INDIRECT(D13)=\"\"),99329,INDIRECT(D13))","v":84092},null,null,"Sheet1!D16",null,"JOB ZIP","Zip Multi",null,null,"City Loc"]
[{"$f":"IF(ISERROR($J15),\"9\",(IF(($J15>24),\"P5\",IF(($J15>18),\"P4\",IF(($J15>12),\"P3\",IF(($J15>6),\"P2\",\"9\"))))))","v":"9"}]
[{"$f":"IF(G15=\"Y\",J15,\"9\")","v":{"$error":"#N/A"}},{"$f":"IF(A15=0,\"ERROR! Check city spelling and/or zip\",\"\")","v":{"$error":"#N/A"}},null,null,null,"JOB CITY",{"$f":"VLOOKUP(A13,[1]Sheet3!$A$1:$D$65536,4,FALSE)","v":{"$error":"#N/A"}},null,null,{"$f":"SUMPRODUCT(([1]Sheet3!$B$3:$B$8009=[1]Sheet1!$D$14)*([1]Sheet3!$A$3:$A$8009=[1]Sheet1!$D$16)*([1]Sheet3!$E$3:$E$8009))","v":0}]
["E"]
[{"$f":"IF((INDIRECT(D17))=\"\",\".\",UPPER(INDIRECT(D17)))","v":"FSS"},null,null,"Sheet1!B14",null,"GC NAME"]
["US",null,null,null,null,"GC COUNTRY"]
[{"$f":"IF((INDIRECT(D19))=\"\",\".\",UPPER(INDIRECT(D19)))","v":"3802 SOUTH 2300 EAST"},null,null,"Sheet1!B15",null,"GC ADDRESS"]
[{"$f":"IF((INDIRECT(D20))=\"\",\".\",UPPER(INDIRECT(D20)))","v":"UT"},null,null,"Sheet1!B17"]
[".",null,null,"Sheet1!B18"]
[{"$f":"IF((INDIRECT(D22)=\"\"),99329,INDIRECT(D22))","v":84109},null,null,"Sheet1!B18",null,"GC ZIP"]
[{"$f":"IF(ISERROR($J24),\"9\",(IF(($J24>24),\"P5\",IF(($J24>18),\"P4\",IF(($J24>12),\"P3\",IF(($J24>6),\"P2\",\"9\"))))))","v":"9"}]
[{"$f":"IF(G24=\"Y\",J24,\"9\")","v":{"$error":"#N/A"}},{"$f":"IF(A24=0,\"ERROR! Check city spelling and/or zip\",\"\")","v":{"$error":"#N/A"}},null,null,null,"GC CITY",{"$f":"VLOOKUP(A22,[1]Sheet3!$A$1:$D$65536,4,FALSE)","v":{"$error":"#N/A"}},null,null,{"$f":"SUMPRODUCT(([1]Sheet3!$B$3:$B$8009=[1]Sheet1!$B$16)*([1]Sheet3!$A$3:$A$8009=[1]Sheet1!$B$18)*([1]Sheet3!$E$3:$E$8009))","v":0}]
["E"]
[{"$f":"IF(INDIRECT(D26)=0,\"806-111-1111\",INDIRECT(D26))","v":8012776464},null,null,"Sheet1!B19",null,"GC PHONE"]
[{"$f":"IF(INDIRECT(D27)=0,\"806-111-1111\",INDIRECT(D27))","v":"806-111-1111"},null,null,"Sheet1!B20",null,"GC FAX"]
["E",null,null,null,null,"SECONDARY SALESMAN"]
[17]
[{"$f":"IF((INDIRECT(D30))=\"\",\"WA\",UPPER(INDIRECT(D30)))","v":"UT"},null,null,"Sheet1!D15",null,"JOB STATE"]
[19]
[{"$f":"IF((INDIRECT(D32))=\"YES\",\"Y\",IF((INDIRECT(D32))=\"NO\",\"N\",IF((INDIRECT(D32))=\"\",\"N\",UPPER(INDIRECT(D32)))))","v":"N"},null,null,"Sheet1!D20",null,"MUNICIPAL JOB"]
[20]
[{"$f":"IF((INDIRECT(D34))=\"COMMERCIAL\",\"C\",IF((INDIRECT(D34))=\"RESIDENTIAL\",\"R\",IF((INDIRECT(D34))=\"\",\"C\",\"C\")))","v":"C"},null,null,"Sheet1!D21",null,"JOB TYPE"]
["O",null,null,"Sheet1!D22",null,"Taxable","Arun, fix this"]
[{"$f":"IF((INDIRECT(D36))=\"\",\".\",UPPER(INDIRECT(D36)))","v":"HOLLADAY 2550 LLC"},null,null,"Sheet1!D23",null,"OWNER NAME"]
["US"]
[{"$f":"IF((INDIRECT(D38))=\"\",\".\",UPPER(INDIRECT(D38)))","v":"9565 S WASATCH BLVD"},null,null,"Sheet1!D24",null,"OWNER ADDRESS"]
[".",null,null,"Sheet1!D24"]
[".",null,null,"Sheet1!D25"]
[{"$f":"IF((INDIRECT(D41)=\"\"),99329,INDIRECT(D41))","v":84092},null,null,"Sheet1!D27",null,"OWNER ZIP"]
[{"$f":"IF(ISERROR($J43),\"9\",(IF(($J43>24),\"P5\",IF(($J43>18),\"P4\",IF(($J43>12),\"P3\",IF(($J43>6),\"P2\",\"9\"))))))","v":"9"}]
[{"$f":"IF(G43=\"Y\",J43,\"9\")","v":{"$error":"#N/A"}},{"$f":"IF(A43=0,\"ERROR! Check city spelling and/or zip\",\"\")","v":{"$error":"#N/A"}},null,null,null,null,{"$f":"VLOOKUP(A41,[1]Sheet3!$A$1:$D$65536,4,FALSE)","v":{"$error":"#N/A"}},null,null,{"$f":"SUMPRODUCT(([1]Sheet3!$B$3:$B$8009=[1]Sheet1!$D$25)*([1]Sheet3!$A$3:$A$8009=[1]Sheet1!$D$27)*([1]Sheet3!$E$3:$E$8009))","v":0}]
["E"]
["E"]
["S"]
[{"$f":"IF((INDIRECT(D47))=\"\",\".\",UPPER(INDIRECT(D47)))","v":"OLD REPUBLIC SURETY COMPANY"},null,null,"Sheet1!B22",null,"SURETY NAME"]
["US"]
[{"$f":"IF((INDIRECT(D49))=\"\",\".\",UPPER(INDIRECT(D49)))","v":"."},null,null,"Sheet1!B230",null,"SURETY ADDRESS"]
[".",null,null,"Sheet1!B26"]
[".",null,null,"Sheet1!B27"]
[{"$f":"IF((INDIRECT(D52)=\"\"),99329,INDIRECT(D52))","v":5320},null,null,"Sheet1!B26",null,"SURETY ZIP"]
[{"$f":"IF(ISERROR($J54),\"9\",(IF(($J54>24),\"P5\",IF(($J54>18),\"P4\",IF(($J54>12),\"P3\",IF(($J54>6),\"P2\",\"9\"))))))","v":"9"}]
[{"$f":"IF(G54=\"Y\",J54,\"9\")","v":{"$error":"#N/A"}},{"$f":"IF(A54=0,\"ERROR! Check city spelling and/or zip\",\"\")","v":{"$error":"#N/A"}},null,null,null,"SURETY CITY",{"$f":"VLOOKUP(A52,[1]Sheet3!$A$1:$D$65536,4,FALSE)","v":{"$error":"#N/A"}},null,null,{"$f":"SUMPRODUCT(([1]Sheet3!$B$3:$B$8009=[1]Sheet1!$B$24)*([1]Sheet3!$A$3:$A$8009=[1]Sheet1!$B$26)*([1]Sheet3!$E$3:$E$8009))","v":0}]
["E"]
["E"]
["L"]
[{"$f":"IF((INDIRECT(D58))=\"\",\"NO LENDER\",UPPER(INDIRECT(D58)))","v":"FIRE SUPPRESSION SERVICES INC."},null,null,"Sheet1!D30",null,"LENDER NAME"]
["US"]
[{"$f":"IF((INDIRECT(D60))=\"\",\".\",UPPER(INDIRECT(D60)))","v":"."},null,null,"Sheet1!D31",null,"LENDER ADDRESS"]
["."]
["."]
[{"$f":"IF((INDIRECT(D63)=\"\"),99329,INDIRECT(D63))","v":99329},null,null,"Sheet1!D34",null,"LENDER ZIP"]
[{"$f":"IF(ISERROR($J65),\"9\",(IF(($J65>24),\"P5\",IF(($J65>18),\"P4\",IF(($J65>12),\"P3\",IF(($J65>6),\"P2\",\"9\"))))))","v":"9"}]
[{"$f":"IF(G65=\"Y\",J65,\"9\")","v":"9"},{"$f":"IF(A65=0,\"ERROR! Check city spelling and/or zip\",\"\")","v":""},null,null,null,"LENDER CITY",{"$f":"VLOOKUP(A63,[1]Sheet3!$A$1:$D$65536,4,FALSE)","v":"N"},null,null,{"$f":"SUMPRODUCT(([1]Sheet3!$B$3:$B$8009=[1]Sheet1!$D$32)*([1]Sheet3!$A$3:$A$8009=[1]Sheet1!$D$34)*([1]Sheet3!$E$3:$E$8009))","v":0}]
["E"]
["E"]
[27]
[60,"<---",null,null,null,"DAYS TO FILE LIEN"]
[21]
[{"$f":"IF((INDIRECT(D71))=\"YES\",\"Y\",IF((INDIRECT(D71))=\"NO\",\"N\",IF((INDIRECT(D71))=\"\",\"N\",UPPER(INDIRECT(D71)))))","v":"N"},null,null,"Sheet1!D20",null,"BONDED"]
[{"$f":"IF((INDIRECT(D72))=\"\",\".\",UPPER(INDIRECT(D72)))","v":"OLD REPUBLIC SURETY COMPANY"},null,null,"Sheet1!B22",null,"SURETY NAME"]
[{"$f":"IF((INDIRECT(D73))=\"\",\".\",UPPER(INDIRECT(D73)))","v":"N/A"},null,null,"Sheet1!B28",null,"BOND #"]
["."]
[{"$f":"IF(([1]Sheet1!B40=\"\"),\"S\",([1]Sheet1!B40))","v":"S"},null,null,"Sheet1!B40",null,"SURETY AM BEST RATING"]
["SA",null,null,null,null,"SUBMIT APP"]
[".",null,null,null,null,"BRANCH #"]
["N ",null,null,null,null,"ARE YOU SURE?"]
[{"$f":"IF((INDIRECT(D79))=\"\",\".\",UPPER(INDIRECT(D79)))","v":"FSS"},null,null,"Sheet1!B14",null,"GC NAME"]
["H"]
[4]
[{"$f":"IF((INDIRECT(D82))=\"\",\".\",UPPER(INDIRECT(D82)))","v":"FSS"},null,null,"Sheet1!B14",null,"GC NAME"]
["END",null,null,"Sheet1!B15",null,"GC ADDRESS"]
["END",null,null,"Sheet1!B17"]
[{"$f":"IF(INDIRECT(D85)=0,\"806-111-1111\",INDIRECT(D85))","v":8012776464},null,null,"Sheet1!B19",null,"GC PHONE"]
[{"$f":"IF(INDIRECT(D86)=0,\"806-111-1111\",INDIRECT(D86))","v":"806-111-1111"},null,null,"Sheet1!B20",null,"GC FAX"]
["."]
[{"$f":"IF((INDIRECT(D88))=\"\",\"WA\",UPPER(INDIRECT(D88)))","v":"UT"},null,null,"Sheet1!D15",null,"JOB STATE"]
[{"$f":"IF((INDIRECT(D89))=\"\",\"C\",UPPER(INDIRECT(D89)))","v":"COMMERCIAL"},null,null,"Sheet1!D21",null,"JOB TYPE"]
[{"$f":"IF((INDIRECT(D90))=\"YES\",\"Y\",IF((INDIRECT(D90))=\"NO\",\"N\",IF((INDIRECT(D90))=\"\",\"N\",UPPER(INDIRECT(D90)))))","v":"N"},null,null,"Sheet1!D20",null,"BONDED"]
[{"$f":"IF(([1]Sheet1!B40=\"\"),\"S\",([1]Sheet1!B40))","v":"S"},null,null,"Sheet1!B40",null,"SURETY AM BEST RATING"]
[{"$f":"INDIRECT(D92)","v":6000},null,null,"Sheet1!D19",null,"JOB AMOUNT"]
[]
[]
["Copy and paste the highlighted cells (light green) below into Trilogie in order to contract the bid to the job account."]
[2]
[2]
[24]
[null,"<----"]
["Y"]
[{"$f":"INDIRECT(D101)","v":0},null,null,"Sheet1!B39",null,"BID #"]
[{"$f":"INDIRECT(D102)","v":0},null,null,"Sheet1!B41",null,"CUST #"]
[" ",null,null,null,null,"BLANK"]
[{"$f":"TODAY()+365","v":"2023-12-20"},null,null,null,null,"1 YEAR FROM NOW"]
["E"]
[]
["."]
["END"]
["END"]
[]
[]
["Copy and paste the highlighted cells (light green) below into Trilogie in order to create the ship to suffix"]
["CFM"]
[{"$f":"INDIRECT(D114)","v":0},null,null,"Sheet1!B41",null,"NEW JOB #"]
["S"]
[1]
["Y"]
[{"$f":"INDIRECT(D118)","v":"Fire Suppression Services Incorporated"},null,null,"Sheet1!B7",null,"CUST NAME"]
["US",null,null,null,null,"COUNTRY"]
[{"$f":"INDIRECT(D120)","v":"La Caille"},null,null,"Sheet1!D7",null,"JOB NAME"]
[{"$f":"IF((INDIRECT(D121))=\"\",\".\",UPPER(INDIRECT(D121)))","v":"9565 SOUTH WASATCH BOULEVARD"},null,null,"Sheet1!D11",null,"JOB ADDRESS"]
[{"$f":"IF((INDIRECT(D122))=\"\",\".\",UPPER(INDIRECT(D122)))","v":"."},null,null,"Sheet1!D12",null,"JOB ADDRESS 2"]
[{"$f":"IF((INDIRECT(D123)=\"\"),99329,INDIRECT(D123))","v":84092},null,null,"Sheet1!D16",null,"JOB ZIP","Zip Multi"]
[{"$f":"IF(ISERROR($J125),\"9\",(IF(($J125>24),\"P5\",IF(($J125>18),\"P4\",IF(($J125>12),\"P3\",IF(($J125>6),\"P2\",\"9\"))))))","v":"9"}]
[{"$f":"IF(G125=\"Y\",J125,\"9\")","v":{"$error":"#N/A"}},{"$f":"IF(A125=0,\"ERROR! Check city spelling and/or zip\",\"\")","v":{"$error":"#N/A"}},null,null,null,"JOB CITY",{"$f":"VLOOKUP(A123,[1]Sheet3!$A$1:$D$65536,4,FALSE)","v":{"$error":"#N/A"}},null,null,{"$f":"SUMPRODUCT(([1]Sheet3!$B$3:$B$8009=[1]Sheet1!$D$14)*([1]Sheet3!$A$3:$A$8009=[1]Sheet1!$D$16)*([1]Sheet3!$E$3:$E$8009))","v":0}]
["E"]
[{"$f":"D127","v":"WA4200"},"<----",null,{"$f":"IF([1]Sheet1!D22=\"Y\",\"WAE\",IF([1]Sheet1!D22=\"YES\",\"WAE\",\"WA4200\"))","v":"WA4200"},null,"CHANGE THIS AFTER SETUP"]

{"sheet":"Sheet3","index":2,"n_rows":7355,"n_cols":5,"rows_kept":7355,"cut":false,"hidden":false,"merged":[]}
["CREDIT DEPARTMENT USE ONLY",null,null,"WA OR ID CA NV HI"]
["ZIP","City",null,"Multiple","City Loc"]
[6183,"HARTFORD",null,"Y",1]
[6183,"HFD",null,"Y",1]
[6183,"HTFD",null,"Y",1]
[6183,"TRAVELERS INS",null,"Y",1]
[10270,"NEW YORK",null,"Y",2]
[19106,"Philadelphia",null,"Y",2]
[32814,"ORLANDO",null,"N",1]
[57117,"Sioux Falls",null,"N",1]
[60196,"SCHAUMBURG",null,"Y",3]
[83201,"ALAMEDA",null,"Y",1]
[83201,"POCATELLO",null,"Y",2]
[83201,"TYHEE",null,"Y",3]
[83201,"WESTWOOD VILLAGE",null,"Y",4]
[83202,"CHUBBUCK",null,"Y",1]
[83202,"POCATELLO",null,"Y",2]
[83203,"FORT HALL",null,"Y",1]
[83203,"FORT HALL INDIAN RESERVATION",null,"Y",2]
[83203,"FT HALL",null,"Y",3]
[83203,"GIBSON",null,"Y",4]
[83203,"POCATELLO",null,"Y",5]
[83204,"BANNOCK",null,"Y",1]
[83204,"POCATELLO",null,"Y",2]
[83205,"POCATELLO",null,"N",1]
[83206,"ALAMEDA",null,"Y",1]
[83206,"POCATELLO",null,"Y",2]
[83209,"POCATELLO",null,"N",1]
[83210,"ABERDEEN",null,"Y",1]
[83210,"STERLING",null,"Y",2]
[83211,"AM FALLS",null,"Y",1]
[83211,"AMERICAN FALLS",null,"Y",2]
[83211,"HEGLAR",null,"Y",3]
[83211,"NEELEY",null,"Y",4]
[83211,"RAFT RIVER",null,"Y",5]
[83212,"ARBON",null,"N",1]
[83213,"ARCO",null,"Y",1]
[83213,"CRATERS OF THE MOON NATIONAL",null,"Y",2]
[83214,"ARIMO",null,"Y",1]
[83214,"GARDEN CREEK",null,"Y",2]
[83214,"HAWKINS",null,"Y",3]
[83214,"ROBIN",null,"Y",4]
[83215,"ATOMIC CITY",null,"N",1]
[83217,"BANCROFT",null,"Y",1]
[83217,"CHESTERFIELD",null,"Y",2]
[83217,"LUND",null,"Y",3]
[83217,"PEBBLE",null,"Y",4]
[83218,"BASALT",null,"N",1]
[83220,"BERN",null,"Y",1]
[83220,"MONTPELIER",null,"Y",2]
[83221,"BLACKFOOT",null,"Y",1]
[83221,"GROVELAND",null,"Y",2]
[83221,"RIVERSIDE",null,"Y",3]
[83221,"ROCKFORD",null,"Y",4]
[83221,"ROSE",null,"Y",5]
[83221,"TABER",null,"Y",6]
[83221,"THOMAS",null,"Y",7]
[83221,"THOMAS JUNCTION",null,"Y",8]
[83221,"WAPELLO",null,"Y",9]
[83223,"BLOOMINGTON",null,"N",1]
[83226,"CHALLIS",null,"N",1]
[83227,"CLAYTON",null,"Y",1]
[83227,"TORREY",null,"Y",2]
[83228,"CLIFTON",null,"N",1]
[83229,"CHALLIS",null,"Y",1]
[83229,"COBALT",null,"Y",2]
[83230,"CONDA",null,"Y",1]
[83230,"HENRY",null,"Y",2]
[83230,"SODA SPRINGS",null,"Y",3]
[83232,"DAYTON",null,"N",1]
[83233,"DINGLE",null,"N",1]
[83234,"DOWNEY",null,"Y",1]
[83234,"VIRGINIA",null,"Y",2]
[83235,"ELLIS",null,"N",1]
[83236,"FIRTH",null,"Y",1]
[83236,"KIMBALL",null,"Y",2]
[83236,"LOWER PRESTO",null,"Y",3]
[83237,"FRANKLIN",null,"N",1]
[83238,"GENEVA",null,"Y",1]
[83238,"RAYMOND",null,"Y",2]
[83239,"GEORGETOWN",null,"N",1]
[83241,"BENCH",null,"Y",1]
[83241,"CENTRAL",null,"Y",2]
[83241,"GRACE",null,"Y",3]
[83241,"LAGO",null,"Y",4]
[83241,"NITER",null,"Y",5]
[83241,"TURNER",null,"Y",6]
[83243,"HOLBROOK",null,"N",1]
[83244,"CLYDE",null,"Y",1]
[83244,"HOWE",null,"Y",2]
[83245,"INKOM",null,"N",1]
[83246,"LAVA HOT SPRINGS",null,"Y",1]
[83246,"TOPAZ",null,"Y",2]
[83250,"MCCAMMON",null,"N",1]
[83251,"CHILLY",null,"Y",1]
[83251,"MACKAY",null,"Y",2]
[83252,"CHERRY CREEK",null,"Y",1]
[83252,"DANIELS",null,"Y",2]
[83252,"GWENFORD",null,"Y",3]
[83252,"MALAD",null,"Y",4]
[83252,"MALAD CITY",null,"Y",5]
[83252,"PLEASANTVIEW",null,"Y",6]
[83252,"STONE",null,"Y",7]
[83252,"WOODRUFF",null,"Y",8]
[83253,"MAY",null,"Y",1]
[83253,"PATTERSON",null,"Y",2]
[83254,"BENNINGTON",null,"Y",1]
[83254,"LIBERTY",null,"Y",2]
[83254,"MONTPELIER",null,"Y",3]
[83254,"NOUNAN",null,"Y",4]
[83254,"OVID",null,"Y",5]
[83254,"PEGRAM",null,"Y",6]
[83254,"WARDBORO",null,"Y",7]
[83255,"DARLINGTON",null,"Y",1]
[83255,"GROUSE",null,"Y",2]
[83255,"LESLIE",null,"Y",3]
[83255,"MOORE",null,"Y",4]
[83256,"MORELAND",null,"N",1]
[83261,"DINGLE",null,"Y",1]
[83261,"GLENCOE",null,"Y",2]
[83261,"PARIS",null,"Y",3]
[83262,"PINGREE",null,"N",1]
[83263,"FAIRVIEW",null,"Y",1]
[83263,"GLENDALE",null,"Y",2]
[83263,"MAPLETON",null,"Y",3]
[83263,"MINK CREEK",null,"Y",4]
[83263,"OXFORD",null,"Y",5]
[83263,"PRESTON",null,"Y",6]
[83263,"RIVERDALE",null,"Y",7]
[83263,"TREASURETON",null,"Y",8]
[83263,"WHITNEY",null,"Y",9]
[83271,"ROCKLAND",null,"Y",1]
[83271,"ROY",null,"Y",2]
[83272,"SAINT CHARLES",null,"Y",1]
[83272,"ST CHARLES",null,"Y",2]
[83274,"GOSHEN",null,"Y",1]
[83274,"JAMESTOWN",null,"Y",2]
[83274,"SHELLEY",null,"Y",3]
[83274,"WOODVILLE",null,"Y",4]
[83276,"SODA SPRINGS",null,"N",1]
[83277,"SPRINGFIELD",null,"N",1]
[83278,"BONANZA",null,"Y",1]
[83278,"LOWER STANLEY",null,"Y",2]
[83278,"REDFISH LAKE",null,"Y",3]
[83278,"STANLEY",null,"Y",4]
[83278,"SUNBEAM",null,"Y",5]
[83280,"MALAD CITY",null,"Y",1]
[83280,"STONE",null,"Y",2]
[83281,"SWANLAKE",null,"N",1]
[83283,"GRACE",null,"Y",1]
[83283,"THATCHER",null,"Y",2]
[83285,"GRAY",null,"Y",1]
[83285,"SODA SPRINGS",null,"Y",2]
[83285,"WAYAN",null,"Y",3]
[83286,"LINROSE",null,"Y",1]
[83286,"WESTON",null,"Y",2]
[83287,"FISH HAVEN",null,"Y",1]
[83287,"PARIS",null,"Y",2]
[83301,"HOLLISTER",null,"Y",1]
[83301,"LYNWOOD",null,"Y",2]
[83301,"THREE CREEK",null,"Y",3]
[83301,"TWIN FALLS",null,"Y",4]
[83302,"ROGERSON",null,"Y",1]
[83302,"THREE CREEK",null,"Y",2]
[83302,"TWIN FALLS",null,"Y",3]
[83303,"TWIN FALLS",null,"Y",2]
[83311,"ALBION",null,"N",1]
[83312,"ALMO",null,"N",1]
[83313,"BELLEVUE",null,"Y",1]
[83313,"BROADFORD",null,"Y",2]
[83313,"GANNETT",null,"Y",3]
[83314,"BLISS",null,"Y",1]
[83314,"MELLON VALLEY",null,"Y",2]
[83314,"TUTTLE",null,"Y",3]
[83316,"BUHL",null,"Y",1]
[83316,"CLOVER",null,"Y",2]
[83316,"DEEP CREEK",null,"Y",3]
[83318,"BURLEY",null,"Y",1]
[83318,"PELLA",null,"Y",2]
[83318,"SPRINGDALE",null,"Y",3]
[83318,"STARRHS FERRY",null,"Y",4]
[83318,"VIEW",null,"Y",5]
[83320,"CAREY",null,"Y",1]
[83320,"MULDOON",null,"Y",2]
[83321,"CASTLEFORD",null,"Y",1]
[83321,"ROSEWORTH",null,"Y",2]
[83322,"CORRAL",null,"Y",1]
[83322,"FAIRFIELD",null,"Y",2]
[83323,"COTTEREL",null,"Y",1]
[83323,"DECLO",null,"Y",2]
[83323,"IDAHOME",null,"Y",3]
[83324,"DIETRICH",null,"Y",1]
[83324,"SHOSHONE",null,"Y",2]
[83325,"EDEN",null,"N",1]
[83326,"ELBA",null,"N",1]
[83327,"FAIRFIELD",null,"N",1]
[83328,"CURRY",null,"Y",1]
[83328,"FILER",null,"Y",2]
[83330,"GOODING",null,"N",1]
[83332,"HAGERMAN",null,"N",1]
[83333,"HAILEY",null,"Y",1]
[83333,"HOT SPRING LANDING",null,"Y",2]
[83333,"MAGIC CITY",null,"Y",3]
[83333,"TRIUMPH",null,"Y",4]
[83334,"HANSEN",null,"Y",1]
[83334,"ROCK CREEK",null,"Y",2]
[83335,"GREENWOOD",null,"Y",1]
[83335,"HAZELTON",null,"Y",2]
[83335,"HUNT",null,"Y",3]
[83336,"HEYBURN",null,"N",1]
[83337,"HILL CITY",null,"N",1]
[83338,"APPLETON",null,"Y",1]
[83338,"BARRYMORE",null,"Y",2]
[83338,"FALLS CITY",null,"Y",3]
[83338,"JEROME",null,"Y",4]
[83338,"SUGAR LOAF",null,"Y",5]
[83340,"KETCHUM",null,"Y",1]
[83340,"OBSIDIAN",null,"Y",2]
[83341,"KIMBERLY",null,"N",1]
[83342,"BRIDGE",null,"Y",1]
[83342,"CONNER",null,"Y",2]
[83342,"MALTA",null,"Y",3]
[83342,"NAF",null,"Y",4]
[83342,"SUBLETT",null,"Y",5]
[83343,"MINIDOKA",null,"Y",1]
[83343,"RUPERT",null,"Y",2]
[83344,"MURTAUGH",null,"N",1]
[83346,"BASIN",null,"Y",1]
[83346,"CHURCHILL",null,"Y",2]
[83346,"MARION",null,"Y",3]
[83346,"OAKLEY",null,"Y",4]
[83347,"PAUL",null,"N",1]
[83348,"PICABO",null,"Y",2]
[83349,"BURMAH",null,"Y",1]
[83349,"RICHFIELD",null,"Y",2]
[83350,"ACEQUIA",null,"Y",1]
[83350,"JACKSON",null,"Y",2]
[83350,"RUPERT",null,"Y",3]
[83352,"LONE STAR",null,"Y",1]
[83352,"MAGIC RESORT",null,"Y",2]
[83352,"SHOSHONE",null,"Y",3]
[83353,"SUN VALLEY",null,"N",1]
[83354,"ELK HORN",null,"Y",1]
[83354,"SUN VALLEY",null,"Y",2]
[83355,"WENDELL",null,"N",1]
[83401,"BEACHS CORNER",null,"Y",1]
[83401,"BONE",null,"Y",2]
[83401,"COLTMAN",null,"Y",3]
[83401,"GARFIELD",null,"Y",4]
[83401,"GRANT",null,"Y",5]
[83401,"HILLVIEW",null,"Y",6]
[83401,"IDAHO FALLS",null,"Y",7]
[83401,"LINCOLN",null,"Y",8]
[83401,"NEW SWEDEN",null,"Y",9]
[83401,"OSGOOD",null,"Y",10]
[83401,"SAINT LEON",null,"Y",11]
[83401,"SHELTON",null,"Y",12]
[83401,"SKYLINE",null,"Y",13]
[83401,"TAYLOR",null,"Y",14]
[83402,"EAGLE ROCK",null,"Y",1]
[83402,"IDAHO FALLS",null,"Y",2]
[83403,"IDAHO FALLS",null,"N",1]
[83404,"IDAHO FALLS",null,"N",1]
[83405,"IDAHO FALLS",null,"N",1]
[83406,"AMMON",null,"Y",1]
[83406,"IDAHO FALLS",null,"Y",2]
[83415,"IDAHO FALLS",null,"N",1]
[83420,"ASHTON",null,"Y",1]
[83420,"ASHTON",null,"Y",2]
[83420,"DRUMMOND",null,"Y",3]
[83420,"LAMONT",null,"Y",4]
[83420,"MARYSVILLE",null,"Y",5]
[83420,"WARM RIVER",null,"Y",6]
[83421,"CHESTER",null,"N",1]
[83422,"BATES",null,"Y",1]
[83422,"DRIGGS",null,"Y",2]
[83423,"ARGORA",null,"Y",1]
[83423,"DUBOIS",null,"Y",2]
[83423,"IDMAN",null,"Y",3]
[83423,"KILGORE",null,"Y",4]
[83423,"LIDY HOT SPRINGS",null,"Y",5]
[83423,"RENO",null,"Y",6]
[83423,"SMALL",null,"Y",7]
[83424,"FELT",null,"Y",1]
[83424,"TETONIA",null,"Y",2]
[83425,"HAMER",null,"N",1]
[83427,"IONA",null,"N",1]
[83428,"IRWIN",null,"Y",1]
[83428,"PALISADES",null,"Y",2]
[83429,"BOX CANYON",null,"Y",1]
[83429,"ISLAND PARK",null,"Y",2]
[83429,"LAST CHANCE RESORT",null,"Y",3]
[83429,"PONDS RESORT",null,"Y",4]
[83431,"LEWISVILLE",null,"N",1]
[83433,"BIG SPRINGS",null,"Y",1]
[83433,"ISLAND PARK",null,"Y",2]
[83433,"MACKS INN",null,"Y",3]
[83434,"MENAN",null,"N",1]
[83435,"MONTEVIEW",null,"N",1]
[83436,"CANYON CREEK",null,"Y",1]
[83436,"CLEMENTSVILLE",null,"Y",2]
[83436,"NEWDALE",null,"Y",3]
[83438,"PARKER",null,"N",1]
[83440,"ARCHER",null,"Y",1]
[83440,"BURTON",null,"Y",2]
[83440,"EDMONDS",null,"Y",3]
[83440,"LYMAN",null,"Y",4]
[83440,"PLANO",null,"Y",5]
[83440,"REXBURG",null,"Y",6]
[83440,"SUNNYDELL",null,"Y",7]
[83440,"THORNTON",null,"Y",8]
[83441,"REXBURG",null,"N",1]
[83442,"ANNIS",null,"Y",1]
[83442,"LABELLE",null,"Y",2]
[83442,"LORENZO",null,"Y",3]
[83442,"RIGBY",null,"Y",4]
[83443,"ANTELOPE",null,"Y",1]
[83443,"HEISE",null,"Y",2]
[83443,"RIRIE",null,"Y",3]
[83444,"ROBERTS",null,"N",1]
[83445,"ANTHONY",null,"Y",1]
[83445,"EGIN",null,"Y",2]
[83445,"HEMAN",null,"Y",3]
[83445,"SAINT ANTHONY",null,"Y",4]
[83445,"TWIN GROVES",null,"Y",5]
[83445,"WILFORD",null,"Y",6]
[83446,"DUBOIS",null,"Y",1]
[83446,"HUMPHREY",null,"Y",2]
[83446,"SPENCER",null,"Y",3]
[83447,"ASHTON",null,"Y",1]
[83447,"ASHTON",null,"Y",2]
[83447,"SQUIRREL",null,"Y",3]
[83448,"SUGAR CITY",null,"N",1]
[83449,"SWAN VALLEY",null,"N",1]
[83450,"MUD LAKE",null,"Y",1]
[83450,"TERRETON",null,"Y",2]
[83451,"TETON",null,"N",1]
[83452,"CLAWSON",null,"Y",1]
[83452,"TETONIA",null,"Y",2]
[83454,"UCON",null,"N",1]
[83455,"FOX CREEK",null,"Y",1]
[83455,"VERNON",null,"Y",2]
[83455,"VICTOR",null,"Y",3]
[83460,"REXBURG",null,"N",1]
[83462,"CARMEN",null,"N",1]
[83463,"GIBBONSVILLE",null,"N",1]
[83464,"BLUE DOME",null,"Y",1]
[83464,"LEADORE",null,"Y",2]
[83464,"LONE PINE",null,"Y",3]
[83465,"LEMHI",null,"N",1]
[83466,"NORTH FORK",null,"N",1]
[83467,"BAKER",null,"Y",1]
[83467,"ELK BEND",null,"Y",2]
[83467,"SALMON",null,"Y",3]
[83468,"TENDOY",null,"N",1]
[83469,"NORTH FORK",null,"Y",1]
[83469,"SHOUP",null,"Y",2]
[83501,"LEWISTON",null,"N",1]
[83520,"AHSAHKA",null,"N",1]
[83522,"COTTONWOOD",null,"Y",1]
[83522,"KEUTERVILLE",null,"Y",2]
[83523,"CRAIGMONT",null,"N",1]
[83524,"CULDESAC",null,"N",1]
[83525,"DIXIE",null,"Y",1]
[83525,"ELK CITY",null,"Y",2]
[83526,"FERDINAND",null,"N",1]
[83530,"GRANGEVILLE",null,"N",1]
[83531,"FENN",null,"Y",1]
[83531,"GRANGEVILLE",null,"Y",2]
[83533,"COTTONWOOD",null,"Y",1]
[83533,"GREENCREEK",null,"Y",2]
[83535,"JULIAETTA",null,"N",1]
[83536,"KAMIAH",null,"N",1]
[83537,"KENDRICK",null,"Y",1]
[83537,"SOUTHWICK",null,"Y",2]
[83538,"COTTONWOOD",null,"Y",1]
[83538,"KEUTERVILLE",null,"Y",2]
[83539,"CLEARWATER",null,"Y",1]
[83539,"KOOSKIA",null,"Y",2]
[83539,"LOWELL",null,"Y",3]
[83539,"SYRINGA",null,"Y",4]
[83540,"LAPWAI",null,"Y",1]
[83540,"SWEETWATER",null,"Y",2]
[83541,"LENORE",null,"N",1]
[83542,"LUCILE",null,"N",1]
[83543,"NEZPERCE",null,"N",1]
[83544,"GREER",null,"Y",1]
[83544,"OROFINO",null,"Y",2]
[83545,"PECK",null,"N",1]
[83546,"HEADQUARTERS",null,"Y",1]
[83546,"PIERCE",null,"Y",2]
[83547,"POLLOCK",null,"N",1]
[83548,"CULDESAC",null,"Y",1]
[83548,"REUBENS",null,"Y",2]
[83549,"RIGGINS",null,"N",1]
[83551,"SPALDING",null,"N",1]
[83552,"STITES",null,"N",1]
[83553,"WEIPPE",null,"N",1]
[83554,"COOPERVILLE",null,"Y",1]
[83554,"WHITE BIRD",null,"Y",2]
[83555,"WINCHESTER",null,"N",1]
[83601,"ATLANTA",null,"Y",1]
[83601,"ATLANTA",null,"Y",2]
[83602,"BANKS",null,"N",1]
[83604,"BRUNEAU",null,"Y",1]
[83604,"BRUNEAU VALLEY",null,"Y",2]
[83604,"GRASMERE",null,"Y",3]
[83604,"RIDDLE",null,"Y",4]
[83605,"CALDWELL LABOR CAMP",null,"Y",1]
[83605,"DOLES",null,"Y",2]
[83605,"ENROSE",null,"Y",3]
[83605,"KNOWLTON HEIGHTS",null,"Y",4]
[83605,"SUNNYSLOPE",null,"Y",5]
[83605,"WEITZ",null,"Y",6]
[83606,"CALDWELL",null,"N",1]
[83610,"ALPINE",null,"Y",1]
[83610,"CAMBRIDGE",null,"Y",2]
[83611,"ALPHA",null,"Y",1]
[83611,"CASCADE",null,"Y",2]
[83611,"MACKEY BAR",null,"Y",3]
[83611,"WARM LAKE",null,"Y",4]
[83612,"BEAR",null,"Y",1]
[83612,"COUNCIL",null,"Y",2]
[83612,"CUPRUM",null,"Y",3]
[83612,"GOODRICH",null,"Y",4]
[83612,"HORNET",null,"Y",5]
[83612,"PINE RIDGE",null,"Y",6]
[83612,"TAMARACK",null,"Y",7]
[83615,"DONNELLY",null,"Y",1]
[83615,"ROSEBERRY",null,"Y",2]
[83616,"EAGLE",null,"Y",1]
[83616,"PEARL",null,"Y",2]
[83617,"EMMETT",null,"Y",1]
[83617,"MONTOUR",null,"Y",2]
[83617,"NORTHSIDE",null,"Y",3]
[83619,"FRUITLAND",null,"N",1]
[83620,"FRUITVALE",null,"N",1]
[83622,"CROUCH",null,"Y",1]
[83622,"GARDEN VALLEY",null,"Y",2]
[83622,"SILVER CREEK PLUNGE",null,"Y",3]
[83623,"GLENNS FERRY",null,"N",1]
[83624,"GRAND VIEW",null,"N",1]
[83626,"GREENLEAF",null,"N",1]
[83627,"HAMMETT",null,"Y",1]
[83627,"INDIAN COVE",null,"Y",2]
[83628,"HOMEDALE",null,"N",1]
[83629,"GARDENA",null,"Y",1]
[83629,"HORSESHOE BEND",null,"Y",2]
[83630,"HUSTON",null,"N",1]
[83631,"CENTERVILLE",null,"Y",1]
[83631,"IDAHO CITY",null,"Y",2]
[83631,"NEW CENTERVILLE",null,"Y",3]
[83631,"PIONEERVILLE",null,"Y",4]
[83631,"STAR RANCH",null,"Y",5]
[83631,"STEIRMAN",null,"Y",6]
[83632,"INDIAN VALLEY",null,"N",1]
[83633,"KING HILL",null,"N",1]
[83634,"KUNA",null,"Y",1]
[83634,"MORA",null,"Y",2]
[83635,"LAKE FORK",null,"Y",1]
[83635,"MCCALL",null,"Y",2]
[83636,"LETHA",null,"N",1]
[83637,"LOWMAN",null,"N",1]
[83638,"BURGDORF",null,"Y",1]
[83638,"LARDO",null,"Y",2]
[83638,"MCCALL",null,"Y",3]
[83639,"MARSING",null,"N",1]
[83641,"MELBA",null,"Y",1]
[83641,"STODDARD",null,"Y",2]
[83642,"MERIDIAN",null,"N",1]
[83643,"MESA",null,"N",1]
[83644,"MIDDLETON",null,"N",1]
[83645,"MIDVALE",null,"N",1]
[83647,"ANDERSON DAM",null,"Y",1]
[83647,"FEATHERVILLE",null,"Y",2]
[83647,"MOUNTAIN HOME",null,"Y",3]
[83647,"PARADISE HOT SPRINGS",null,"Y",4]
[83647,"PINE",null,"Y",5]
[83647,"PRAIRIE",null,"Y",6]
[83647,"ROCKY BAR",null,"Y",7]
[83648,"MOUNTAIN HOME A F B",null,"Y",1]
[83648,"MOUNTAIN HOME AIR FORCE BASE",null,"Y",2]
[83650,"MURPHY",null,"Y",1]
[83650,"OREANA",null,"Y",2]
[83650,"REYNOLDS",null,"Y",3]
[83650,"SILVER CITY",null,"Y",4]
[83651,"NAMPA",null,"N",1]
[83652,"NAMPA",null,"N",1]
[83653,"NAMPA",null,"N",1]
[83654,"MEADOWS",null,"Y",1]
[83654,"NEW MEADOWS",null,"Y",2]
[83655,"HAMILTON CORNER",null,"Y",1]
[83655,"NEW PLYMOUTH",null,"Y",2]
[83656,"NOTUS",null,"N",1]
[83657,"GROSS",null,"Y",1]
[83657,"OLA",null,"Y",2]
[83660,"APPLE VALLEY",null,"Y",1]
[83660,"PARMA",null,"Y",2]
[83660,"ROSWELL",null,"Y",3]
[83661,"PAYETTE",null,"N",1]
[83666,"PLACERVILLE",null,"N",1]
[83669,"STAR",null,"N",1]
[83670,"SWEET",null,"N",1]
[83671,"WARREN",null,"N",1]
[83672,"CRYSTAL",null,"Y",1]
[83672,"EATON",null,"Y",2]
[83672,"JONATHAN",null,"Y",3]
[83672,"WEISER",null,"Y",4]
[83676,"WILDER",null,"N",1]
[83677,"STIBNITE",null,"Y",1]
[83677,"YELLOW PINE",null,"Y",2]
[83680,"MERIDIAN",null,"N",1]
[83686,"BOWMONT",null,"Y",1]
[83686,"NAMPA",null,"Y",2]
[83687,"NAMPA",null,"N",1]
[83701,"BOISE",null,"N",1]
[83702,"BOISE",null,"N",1]
[83703,"BOISE",null,"Y",1]
[83703,"COLLISTER",null,"Y",2]
[83704,"BOISE",null,"Y",1]
[83704,"USTICK",null,"Y",2]
[83705,"BOISE",null,"N",1]
[83706,"BOISE",null,"Y",1]
[83706,"MAYFIELD",null,"Y",2]
[83707,"BOISE",null,"N",1]
[83708,"BOISE",null,"N",1]
[83709,"BOISE",null,"N",1]
[83711,"BOISE",null,"N",1]
[83712,"BOISE",null,"N",1]
[83713,"BOISE",null,"N",1]
[83714,"BOISE",null,"N",1]
[83715,"BOISE",null,"N",1]
[83716,"BOISE",null,"N",1]
[83717,"BOISE",null,"N",1]
[83719,"BOISE",null,"N",1]
[83720,"BOISE",null,"N",1]
[83721,"BOISE",null,"N",1]
[83722,"BOISE",null,"N",1]
[83723,"BOISE",null,"N",1]
[83724,"BOISE",null,"N",1]
[83725,"BOISE",null,"N",1]
[83726,"BOISE",null,"N",1]
[83727,"BOISE",null,"Y",1]
[83727,"WEST ONE BANK",null,"Y",2]
[83728,"BOISE",null,"N",1]
[83729,"BOISE",null,"N",1]
[83730,"BOISE",null,"N",1]
[83731,"BOISE",null,"N",1]
[83732,"BOISE",null,"N",1]
[83733,"BOISE",null,"Y",1]
[83733,"WEST ONE BANK",null,"Y",2]
[83735,"BOISE",null,"N",1]
[83744,"BOISE",null,"N",1]
[83756,"BOISE",null,"N",1]
[83757,"BOISE",null,"N",1]
[83788,"BOISE",null,"N",1]
[83801,"ATHOL",null,"Y",1]
[83801,"ATHOL",null,"Y",2]
[83801,"BELMONT",null,"Y",3]
[83801,"CHILCO",null,"Y",4]
[83801,"GRANITE",null,"Y",5]
[83802,"AVERY",null,"N",1]
[83803,"BAYVIEW",null,"N",1]
[83804,"BLANCHARD",null,"N",1]
[83805,"BONNERS FERRY",null,"Y",1]
[83805,"COPELAND",null,"Y",2]
[83806,"BOVILL",null,"N",1]
[83808,"CALDER",null,"N",1]
[83809,"CAREYWOOD",null,"Y",1]
[83809,"SANDPOINT",null,"Y",2]
[83810,"CATALDO",null,"Y",1]
[83810,"ROSE LAKE",null,"Y",2]
[83811,"CABINET",null,"Y",1]
[83811,"CLARK FORK",null,"Y",2]
[83812,"CLARKIA",null,"Y",1]
[83812,"FERNWOOD",null,"Y",2]
[83813,"COCOLALLA",null,"N",1]
[83814,"COEUR D ALENE",null,"N",1]
[83815,"COEUR D ALENE",null,"Y",1]
[83815,"DALTON GARDENS",null,"Y",2]
[83816,"COEUR D ALENE",null,"N",1]
[83821,"COOLIN",null,"N",1]
[83822,"OLDTOWN",null,"N",1]
[83823,"DEARY",null,"Y",1]
[83823,"HELMER",null,"Y",2]
[83824,"DESMET",null,"N",1]
[83825,"DOVER",null,"N",1]
[83826,"EASTPORT",null,"N",1]
[83827,"ELK RIVER",null,"N",1]
[83830,"FERNWOOD",null,"N",1]
[83832,"GENESEE",null,"N",1]
[83833,"HARRISON",null,"N",1]
[83834,"HARVARD",null,"N",1]
[83835,"GARWOOD",null,"Y",1]
[83835,"HAYDEN",null,"Y",2]
[83835,"HAYDEN LAKE",null,"Y",3]
[83836,"EAST HOPE",null,"Y",1]
[83836,"HOPE",null,"Y",2]
[83837,"KELLOGG",null,"Y",1]
[83837,"WARDNER",null,"Y",2]
[83839,"ENAVILLE",null,"Y",1]
[83839,"KINGSTON",null,"Y",2]
[83840,"KOOTENAI",null,"Y",1]
[83840,"SANDPOINT",null,"Y",2]
[83841,"LACLEDE",null,"N",1]
[83842,"HARRISON",null,"Y",1]
[83842,"MEDIMONT",null,"Y",2]
[83843,"MOSCOW",null,"Y",1]
[83843,"UNIVERSITY",null,"Y",2]
[83844,"MOSCOW",null,"N",1]
[83845,"MOYIE SPRINGS",null,"N",1]
[83846,"MULLAN",null,"N",1]
[83847,"NAPLES",null,"N",1]
[83848,"NORDMAN",null,"N",1]
[83849,"OSBURN",null,"N",1]
[83850,"PINEHURST",null,"N",1]
[83851,"PLUMMER",null,"N",1]
[83852,"PONDERAY",null,"N",1]
[83853,"PORTHILL",null,"N",1]
[83854,"HAUSER",null,"Y",1]
[83854,"POST FALLS",null,"Y",2]
[83854,"STATE LINE",null,"Y",3]
[83855,"ONAWAY",null,"Y",1]
[83855,"POTLATCH",null,"Y",2]
[83856,"PRIEST LAKE",null,"Y",1]
[83856,"PRIEST RIVER",null,"Y",2]
[83857,"PRINCETON",null,"N",1]
[83858,"RATHDRUM",null,"Y",1]
[83858,"TWIN LAKES",null,"Y",2]
[83860,"SAGLE",null,"N",1]
[83861,"SAINT MARIES",null,"Y",1]
[83861,"ST MARIES",null,"Y",2]
[83862,"ELMIRA",null,"Y",1]
[83862,"SAMUELS",null,"Y",2]
[83862,"SANDPOINT",null,"Y",3]
[83864,"SANDPOINT",null,"N",1]
[83865,"COLBURN",null,"Y",1]
[83865,"SANDPOINT",null,"Y",2]
[83866,"SANTA",null,"N",1]
[83867,"SILVERTON",null,"N",1]
[83868,"SMELTERVILLE",null,"N",1]
[83869,"SPIRIT LAKE",null,"N",1]
[83870,"SANDERS",null,"Y",1]
[83870,"TENSED",null,"Y",2]
[83871,"TROY",null,"N",1]
[83872,"VIOLA",null,"N",1]
[83873,"PRICHARD",null,"Y",1]
[83873,"WALLACE",null,"Y",2]
[83874,"MURRAY",null,"Y",1]
[83874,"WALLACE",null,"Y",2]
[83876,"WORLEY",null,"N",1]
[83877,"POST FALLS",null,"N",1]
[88901,"The Lakes",null,"N",1]
[88905,"The Lakes",null,"N",1]
[89001,"Alamo",null,"Y",1]
[89001,"Rachel",null,"Y",2]
[89001,"Tempiute",null,"Y",3]
[89003,"Beatty",null,"Y",1]
[89003,"Rhyolite",null,"Y",2]
[89004,"Blue Diamond",null,"Y",1]
[89004,"Old Nevada",null,"Y",2]
[89005,"Boulder City",null,"Y",1]
[89005,"Willow Beach",null,"Y",2]
[89006,"Boulder City",null,"N",1]
[89007,"Bunkerville",null,"Y",1]
[89007,"Riverside",null,"Y",2]
[89008,"Caliente",null,"Y",1]
[89008,"Carp",null,"Y",2]
[89008,"Elgin",null,"Y",3]
[89009,"Henderson",null,"N",1]
[89010,"Dyer",null,"N",1]
[89011,"Henderson",null,"N",1]
[89012,"Henderson",null,"N",1]
[89013,"Gold Point",null,"Y",1]
[89013,"Goldfield",null,"Y",2]
[89013,"Lida",null,"Y",3]
[89014,"Henderson",null,"N",1]
[89015,"Calico Ridge",null,"Y",1]
[89015,"Henderson",null,"Y",2]
[89016,"Henderson",null,"N",1]
[89017,"Ash Springs",null,"Y",1]
[89017,"Crystal Springs",null,"Y",2]
[89017,"Hiko",null,"Y",3]
[89018,"Indian Springs",null,"N",1]
[89019,"Goodsprings",null,"Y",1]
[89019,"Jean",null,"Y",2]
[89019,"Primm",null,"Y",3]
[89019,"Sandy Valley",null,"Y",4]
[89020,"Amargosa Valley",null,"Y",1]
[89020,"Lathrop Wells",null,"Y",2]
[89021,"Logandale",null,"N",1]
[89022,"Manhattan",null,"N",1]
[89023,"Jackass Flats",null,"Y",1]
[89023,"Mercury",null,"Y",2]
[89024,"Mesquite",null,"N",1]
[89025,"Moapa",null,"N",1]
[89026,"Jean",null,"N",1]
[89027,"Mesquite",null,"N",1]
[89028,"Laughlin",null,"N",1]
[89029,"Laughlin",null,"N",1]
[89030,"College Park",null,"Y",1]
[89030,"N Las Vegas",null,"Y",2]
[89030,"North Las Vegas",null,"Y",3]
[89031,"North Las Vegas",null,"N",1]
[89033,"North Las Vegas",null,"N",1]
[89036,"North Las Vegas",null,"N",1]
[89039,"Cal Nev Ari",null,"Y",1]
[89039,"Searchlight",null,"Y",2]
[89040,"Echo Bay",null,"Y",1]
[89040,"Overton",null,"Y",2]
[89040,"Overton Beach",null,"Y",3]
[89040,"Stewarts Point",null,"Y",4]
[89040,"Valley of Fire",null,"Y",5]
[89041,"Crystal",null,"Y",1]
[89041,"Johnnie",null,"Y",2]
[89041,"Pahrump",null,"Y",3]
[89042,"Panaca",null,"N",1]
[89043,"Caselton",null,"Y",1]
[89043,"Dry Valley",null,"Y",2]
[89043,"Eagle Valley",null,"Y",3]
[89043,"Pioche",null,"Y",4]
[89043,"Rose Valley",null,"Y",5]
[89043,"Ursine",null,"Y",6]
[89045,"Carvers",null,"Y",1]
[89045,"Round Mountain",null,"Y",2]
[89046,"Cottonwood Cove",null,"Y",1]
[89046,"Nelson",null,"Y",2]
[89046,"Searchlight",null,"Y",3]
[89047,"Silverpeak",null,"N",1]
[89048,"Pahrump",null,"N",1]
[89049,"Coaldale",null,"Y",1]
[89049,"Tonopah",null,"Y",2]
[89049,"Tonopah Air Force Station",null,"Y",3]
[89049,"Warm Springs",null,"Y",4]
[89053,"Henderson",null,"N",1]
[89070,"Indian Springs",null,"N",1]
[89101,"Las Vegas",null,"N",1]
[89102,"Las Vegas",null,"N",1]
[89103,"Las Vegas",null,"N",1]
[89104,"Las Vegas",null,"N",1]
[89106,"Las Vegas",null,"N",1]
[89107,"Las Vegas",null,"N",1]
[89108,"Las Vegas",null,"N",1]
[89109,"Las Vegas",null,"Y",1]
[89109,"Winchester",null,"Y",2]
[89110,"Las Vegas",null,"N",1]
[89111,"Las Vegas",null,"Y",1]
[89111,"McCarran Airport",null,"Y",2]
[89112,"Las Vegas",null,"N",1]
[89113,"Las Vegas",null,"N",1]
[89114,"Las Vegas",null,"N",1]
[89115,"Las Vegas",null,"N",1]
[89116,"Las Vegas",null,"N",1]
[89117,"Las Vegas",null,"N",1]
[89118,"Arden",null,"Y",1]
[89118,"Las Vegas",null,"Y",2]
[89119,"Las Vegas",null,"N",1]
[89120,"Las Vegas",null,"N",1]
[89121,"Las Vegas",null,"N",1]
[89122,"Las Vegas",null,"N",1]
[89123,"Las Vegas",null,"N",1]
[89124,"Cactus Springs",null,"Y",1]
[89124,"Calico Basin",null,"Y",2]
[89124,"Callville Bay",null,"Y",3]
[89124,"Las Vegas",null,"Y",4]
[89124,"Mountain Springs",null,"Y",5]
[89124,"Mt Charleston",null,"Y",6]
[89124,"Sloan",null,"Y",7]
[89125,"Las Vegas",null,"N",1]
[89126,"Las Vegas",null,"N",1]
[89127,"Las Vegas",null,"N",1]
[89128,"Las Vegas",null,"N",1]
[89129,"Las Vegas",null,"N",1]
[89130,"Las Vegas",null,"N",1]
[89131,"Las Vegas",null,"N",1]
[89132,"Las Vegas",null,"N",1]
[89133,"Las Vegas",null,"N",1]
[89134,"Las Vegas",null,"N",1]
[89135,"Las Vegas",null,"N",1]
[89137,"Las Vegas",null,"N",1]
[89138,"Las Vegas",null,"N",1]
[89139,"Las Vegas",null,"N",1]
[89146,"Las Vegas",null,"N",1]
[89147,"Las Vegas",null,"N",1]
[89150,"Las Vegas",null,"N",1]
[89151,"Las Vegas",null,"N",1]
[89152,"Las Vegas",null,"N",1]
[89153,"Las Vegas",null,"N",1]
[89154,"Las Vegas",null,"N",1]
[89155,"Las Vegas",null,"N",1]
[89158,"Las Vegas",null,"N",1]
[89159,"Las Vegas",null,"N",1]
[89160,"Las Vegas",null,"N",1]
[89163,"Las Vegas",null,"Y",1]
[89163,"The Lakes",null,"Y",2]
[89164,"Las Vegas",null,"Y",1]
[89164,"The Lakes",null,"Y",2]
[89170,"Las Vegas",null,"N",1]
[89177,"Las Vegas",null,"N",1]
[89180,"Las Vegas",null,"N",1]
[89185,"Las Vegas",null,"N",1]
[89191,"Indian Springs Air Force Aux",null,"Y",1]
[89191,"Las Vegas",null,"Y",3]
[89191,"Nellis AFB",null,"Y",4]
[89191,"Nellis Air Force Base",null,"Y",4]
[89193,"Las Vegas",null,"N",1]
[89195,"Las Vegas",null,"N",1]
[89199,"Las Vegas",null,"N",1]
[89301,"Cherry Creek",null,"Y",1]
[89301,"Currie",null,"Y",2]
[89301,"Ely",null,"Y",3]
[89301,"Ely Colony",null,"Y",4]
[89301,"Lane",null,"Y",5]
[89301,"Preston",null,"Y",6]
[89310,"Austin",null,"Y",1]
[89310,"Ione",null,"Y",2]
[89310,"Kingston",null,"Y",3]
[89310,"Reese River",null,"Y",4]
[89311,"Baker",null,"Y",1]
[89311,"Lehman Caves",null,"Y",2]
[89314,"Duckwater",null,"N",1]
[89315,"East Ely",null,"N",1]
[89316,"Eureka",null,"N",1]
[89317,"Lund",null,"N",1]
[89318,"Mc Gill",null,"Y",1]
[89318,"Steptoe",null,"Y",2]
[89319,"Reipetown",null,"Y",1]
[89319,"Ruth",null,"Y",2]
[89402,"Crystal Bay",null,"N",1]
[89403,"Dayton",null,"N",1]
[89404,"Denio",null,"Y",1]
[89404,"Dike",null,"Y",2]
[89404,"Highway 40",null,"Y",3]
[89404,"Jackson Mountain",null,"Y",4]
[89404,"Pueblo Valley",null,"Y",5]
[89404,"Quinn River Crossing",null,"Y",6]
[89405,"Empire",null,"N",1]
[89406,"Carroll Station",null,"Y",1]
[89406,"Cold Spring",null,"Y",2]
[89406,"Dixie Valley",null,"Y",3]
[89406,"Fallon",null,"Y",4]
[89406,"Fallon Colony",null,"Y",5]
[89406,"Frenchman",null,"Y",6]
[89406,"Middlegate",null,"Y",7]
[89406,"Peterson",null,"Y",8]
[89406,"Ragtown",null,"Y",9]
[89406,"Salt Wells",null,"Y",10]
[89406,"Stillwater",null,"Y",11]
[89407,"Fallon",null,"N",1]
[89408,"Fernley",null,"Y",1]
[89408,"Hazen",null,"Y",2]
[89409,"Gabbs",null,"N",1]
[89410,"Centerville",null,"Y",1]
[89410,"Dresslerville",null,"Y",2]
[89410,"Gardnerville",null,"Y",3]
[89410,"Sheridan",null,"Y",4]
[89410,"Topaz Lake",null,"Y",5]
[89410,"Topaz Lodge",null,"Y",6]
[89411,"Genoa",null,"N",1]
[89412,"Gerlach",null,"Y",1]
[89412,"Smoke Creek",null,"Y",2]
[89413,"Glenbrook",null,"Y",1]
[89413,"Lincoln Park",null,"Y",2]
[89414,"Golconda",null,"Y",1]
[89414,"Midas",null,"Y",2]
[89414,"Red House",null,"Y",3]
[89415,"Babbitt",null,"Y",1]
[89415,"Hawthorne",null,"Y",2]
[89415,"Hawthorne Army Ammunition Pl",null,"Y",3]
[89415,"Thorne",null,"Y",4]
[89415,"Walker Lake",null,"Y",5]
[89415,"Whiskey Flats",null,"Y",6]
[89418,"Apache",null,"Y",1]
[89418,"Humboldt",null,"Y",2]
[89418,"Imlay",null,"Y",3]
[89418,"Mill City",null,"Y",4]
[89418,"Nevada Mass",null,"Y",5]
[89418,"Thunder Mountain",null,"Y",6]
[89418,"Tungsten",null,"Y",7]
[89418,"Unionville",null,"Y",8]
[89419,"Lovelock",null,"Y",1]
[89419,"Lower Valley",null,"Y",2]
[89419,"Oreana",null,"Y",3]
[89419,"Rabbit Hole",null,"Y",4]
[89419,"Rye Patch",null,"Y",5]
[89419,"Toulon",null,"Y",6]
[89419,"Trinity",null,"Y",7]
[89419,"Upper Valley",null,"Y",8]
[89420,"Luning",null,"N",1]
[89421,"Cordero",null,"Y",1]
[89421,"Mc Dermitt",null,"Y",2]
[89421,"McDermitt",null,"Y",3]
[89422,"Mina",null,"N",1]
[89423,"Minden",null,"N",1]
[89424,"Nixon",null,"N",1]
[89425,"King River",null,"Y",1]
[89425,"Orovada",null,"Y",2]
[89425,"Rebel Creek",null,"Y",3]
[89426,"Paradise Valley",null,"N",1]
[89427,"Rawhide",null,"Y",1]
[89427,"Schurz",null,"Y",2]
[89427,"Sheelite",null,"Y",3]
[89428,"Silver City",null,"N",1]
[89429,"Silver Springs",null,"Y",1]
[89429,"Stagecoach",null,"Y",2]
[89429,"Weeks",null,"Y",3]
[89430,"Central Valley",null,"Y",1]
[89430,"Smith",null,"Y",2]
[89431,"Greenbrae",null,"Y",1]
[89431,"Happy Valley",null,"Y",2]
[89431,"Sparks",null,"Y",3]
[89431,"Sun Valley",null,"Y",4]
[89432,"Sparks",null,"N",1]
[89433,"Sparks",null,"Y",1]
[89433,"Sun Valley",null,"Y",2]
[89434,"Lockwood",null,"Y",1]
[89434,"McCarran",null,"Y",2]
[89434,"Mustang",null,"Y",3]
[89434,"Patrick",null,"Y",4]
[89434,"Sparks",null,"Y",5]
[89434,"Tracy-Clark",null,"Y",6]
[89435,"Sparks",null,"N",1]
[89436,"Spanish Springs",null,"Y",1]
[89436,"Sparks",null,"Y",2]
[89438,"Valmy",null,"N",1]
[89439,"Verdi",null,"N",1]
[89440,"Gold Hill",null,"Y",1]
[89440,"Virginia City",null,"Y",2]
[89442,"Olinghouse",null,"Y",1]
[89442,"Wadsworth",null,"Y",2]
[89444,"Aurora",null,"Y",1]
[89444,"Simpson",null,"Y",2]
[89444,"Sweetwater",null,"Y",3]
[89444,"Topaz Ranch Estates",null,"Y",4]
[89444,"Wellington",null,"Y",5]
[89445,"Bottle Creek",null,"Y",1]
[89445,"Cosgrave",null,"Y",2]
[89445,"Grass Valley",null,"Y",3]
[89445,"Jungo",null,"Y",4]
[89445,"Paradise Hill",null,"Y",5]
[89445,"Sulphur",null,"Y",6]
[89445,"Weso",null,"Y",7]
[89445,"Winnemucca",null,"Y",8]
[89445,"Winnemucca Colony",null,"Y",9]
[89446,"Winnemucca",null,"N",1]
[89447,"Mason",null,"Y",1]
[89447,"Pizen Switch",null,"Y",2]
[89447,"Wabuska",null,"Y",3]
[89447,"Weed Heights",null,"Y",4]
[89447,"Yerington",null,"Y",5]
[89448,"Cave Rock",null,"Y",1]
[89448,"Elk Point",null,"Y",2]
[89448,"Elks Point",null,"Y",3]
[89448,"Kelmont East",null,"Y",4]
[89448,"Kingsbury",null,"Y",5]
[89448,"Lake Village",null,"Y",6]
[89448,"Marla Bay",null,"Y",7]
[89448,"Pinewild",null,"Y",8]
[89448,"Round Hill",null,"Y",9]
[89448,"Skyland",null,"Y",10]
[89448,"Wittell",null,"Y",11]
[89448,"Zephyr Cove",null,"Y",12]
[89448,"Zephyr Point",null,"Y",13]
[89449,"Lakeridge",null,"Y",1]
[89449,"Stateline",null,"Y",2]
[89449,"Zephyr Cove",null,"Y",3]
[89450,"Incline Village",null,"N",1]
[89451,"Incline Village",null,"N",1]
[89452,"Incline Village",null,"N",1]
[89496,"Fallon",null,"N",1]
[89501,"Reno",null,"N",1]
[89502,"Hidden Valley",null,"Y",1]
[89502,"Reno",null,"Y",2]
[89503,"Lawton",null,"Y",1]
[89503,"Reno",null,"Y",2]
[89504,"Reno",null,"N",1]
[89505,"Reno",null,"N",1]
[89506,"Anderson Acres",null,"Y",1]
[89506,"Black Springs",null,"Y",2]
[89506,"Bordertown",null,"Y",3]
[89506,"Cold Springs",null,"Y",4]
[89506,"Golden Valley",null,"Y",5]
[89506,"Lemmon Valley",null,"Y",6]
[89506,"Panther Valley",null,"Y",7]
[89506,"Rancho Haven",null,"Y",8]
[89506,"Red Rock",null,"Y",9]
[89506,"Reno",null,"Y",10]
[89506,"Sierra",null,"Y",11]
[89506,"Silver Knolls",null,"Y",12]
[89506,"Stead",null,"Y",13]
[89507,"Reno",null,"Y",1]
[89507,"University",null,"Y",2]
[89509,"Reno",null,"N",1]
[89510,"Cannon International Airport",null,"Y",1]
[89510,"Cottonwood Creek",null,"Y",2]
[89510,"Palomino Valley",null,"Y",3]
[89510,"Pyramid",null,"Y",4]
[89510,"Reno",null,"Y",5]
[89510,"Sand Pass",null,"Y",6]
[89510,"Sutcliffe",null,"Y",7]
[89511,"Galena",null,"Y",1]
[89511,"Huffaker",null,"Y",2]
[89511,"Pleasant Valley",null,"Y",3]
[89511,"Reno",null,"Y",4]
[89511,"Steamboat",null,"Y",5]
[89511,"Virginia Foothills",null,"Y",6]
[89512,"Reno",null,"N",1]
[89513,"Reno",null,"N",1]
[89515,"Reno",null,"N",1]
[89520,"Reno",null,"N",1]
[89523,"Mogul",null,"Y",1]
[89523,"Reno",null,"Y",2]
[89533,"Reno",null,"N",1]
[89550,"Reno",null,"Y",1]
[89550,"Security Pacific Bank",null,"Y",2]
[89557,"Reno",null,"N",1]
[89564,"Reno",null,"N",1]
[89570,"Reno",null,"N",1]
[89595,"Reno",null,"Y",1]
[89595,"Reno Hilton",null,"Y",2]
[89599,"Reno",null,"N",1]
[89701,"Carson City",null,"Y",1]
[89701,"Carson City Mall",null,"Y",2]
[89701,"Carson Colony",null,"Y",3]
[89701,"Carson Meadows",null,"Y",4]
[89701,"Clear Creek",null,"Y",5]
[89701,"Jacks Valley",null,"Y",6]
[89701,"Lakeview",null,"Y",7]
[89701,"New Empire",null,"Y",8]
[89701,"New Washoe City",null,"Y",9]
[89701,"Stewart",null,"Y",10]
[89701,"Washoe",null,"Y",11]
[89701,"Washoe Valley",null,"Y",12]
[89702,"Carson City",null,"N",1]
[89703,"Carson City",null,"N",1]
[89704,"Branch #1",null,"Y",1]
[89704,"Carson City",null,"Y",2]
[89704,"Washoe Valley",null,"Y",3]
[89705,"Carson City",null,"N",1]
[89706,"Carson City",null,"Y",1]
[89706,"Mound House",null,"Y",2]
[89710,"Carson City",null,"N",1]
[89711,"Carson City",null,"N",1]
[89712,"Carson City",null,"N",1]
[89713,"Carson City",null,"N",1]
[89714,"Carson City",null,"Y",1]
[89721,"Carson City",null,"N",1]
[89801,"Elko",null,"Y",1]
[89801,"Jiggs",null,"Y",2]
[89801,"Lee",null,"Y",3]
[89801,"North Fork",null,"Y",4]
[89802,"Elko",null,"N",1]
[89803,"Elko",null,"N",1]
[89815,"Elko",null,"Y",1]
[89815,"Spring Creek",null,"Y",2]
[89820,"Batte Mtn",null,"Y",1]
[89820,"Battle Mountain",null,"Y",2]
[89820,"Rixie",null,"Y",3]
[89821,"Beowawe",null,"Y",1]
[89821,"Carlin",null,"Y",2]
[89821,"Crescent Valley",null,"Y",3]
[89821,"Dunphy",null,"Y",4]
[89822,"Carlin",null,"N",1]
[89823,"Deeth",null,"N",1]
[89824,"Elburz",null,"Y",1]
[89824,"Halleck",null,"Y",2]
[89825,"Contact",null,"Y",1]
[89825,"Jackpot",null,"Y",2]
[89825,"San Jacinto",null,"Y",3]
[89826,"Jarbidge",null,"N",1]
[89828,"Lamoille",null,"N",1]
[89830,"Montello",null,"N",1]
[89831,"Mountain City",null,"Y",1]
[89831,"Patsville",null,"Y",2]
[89832,"Duck Valley",null,"Y",1]
[89832,"Owyhee",null,"Y",2]
[89833,"Ruby Valley",null,"Y",1]
[89833,"Shantytown",null,"Y",2]
[89834,"Tuscarora",null,"N",1]
[89835,"Arthur",null,"Y",1]
[89835,"Cobre",null,"Y",2]
[89835,"Cover City",null,"Y",3]
[89835,"Metropolis",null,"Y",4]
[89835,"Oasis",null,"Y",5]
[89835,"Pequop",null,"Y",6]
[89835,"Shafter",null,"Y",7]
[89835,"Thousand Springs",null,"Y",8]
[89835,"Wells",null,"Y",9]
[89835,"Wilkins",null,"Y",10]
[89883,"West Wendover",null,"N",1]
[90001,"FIRESTONE PARK",null,"Y",1]
[90001,"LOS ANGELES",null,"Y",2]
[90002,"LOS ANGELES",null,"Y",1]
[90002,"WATTS",null,"Y",2]
[90003,"BROADWAY MANCHESTER",null,"Y",1]
[90003,"LOS ANGELES",null,"Y",2]
[90004,"LOS ANGELES",null,"Y",1]
[90004,"OAKWOOD",null,"Y",2]
[90005,"LOS ANGELES",null,"Y",1]
[90005,"SANFORD",null,"Y",2]
[90006,"LOS ANGELES",null,"Y",1]
[90006,"PICO HEIGHTS",null,"Y",2]
[90007,"DOCKWEILER",null,"Y",1]
[90007,"LOS ANGELES",null,"Y",2]
[90008,"BALDWIN HILLS",null,"Y",1]
[90008,"BALDWIN HILLS",null,"Y",1]
[90008,"CRENSHAW",null,"Y",2]
[90008,"LEIMERT PARK",null,"Y",2]
[90008,"LOS ANGELES",null,"Y",4]
[90009,"LOS ANGELES",null,"Y",1]
[90009,"LOS ANGELES AFB",null,"Y",2]
[90009,"LOS ANGELES INTERNATIONAL AI",null,"Y",3]
[90010,"LOS ANGELES",null,"Y",1]
[90010,"SANFORD",null,"Y",2]
[90011,"LOS ANGELES",null,"N",1]
[90012,"FEDERAL",null,"Y",1]
[90012,"LOS ANGELES",null,"Y",2]
[90013,"FEDERAL",null,"Y",1]
[90013,"LOS ANGELES",null,"Y",2]
[90014,"DOWTOWN CARRIER ANNEX",null,"N",1]
[90014,"LOS ANGELES",null,"N",1]
[90015,"DEL VALLE",null,"Y",1]
[90015,"DOWTOWN CARRIER ANNEX",null,"Y",2]
[90015,"LOS ANGELES",null,"Y",3]
[90015,"TEXTILE",null,"Y",4]
[90016,"LOS ANGELES",null,"Y",1]
[90016,"WEST ADAMS",null,"Y",2]
[90017,"FOY",null,"Y",1]
[90017,"LOS ANGELES",null,"Y",2]
[90018,"CIMARRON",null,"Y",1]
[90018,"DOCKWEILER",null,"Y",2]
[90018,"LOS ANGELES",null,"Y",3]
[90019,"LOS ANGELES",null,"Y",1]
[90019,"RIMPAU",null,"Y",2]
[90020,"LOS ANGELES",null,"Y",1]
[90020,"SANFORD",null,"Y",2]
[90021,"LOS ANGELES",null,"Y",1]
[90021,"MARKET",null,"Y",2]
[90022,"EAST LOS ANGELES",null,"Y",1]
[90022,"LOS ANGELES",null,"Y",2]
[90023,"LOS ANGELES",null,"Y",1]
[90023,"LUGO",null,"Y",2]
[90024,"LOS ANGELES",null,"Y",1]
[90024,"VILLAGE",null,"Y",2]
[90024,"WESTWOOD",null,"Y",3]
[90025,"LOS ANGELES",null,"Y",1]
[90025,"WEST LOS ANGELES",null,"Y",2]
[90026,"ECHO PARK",null,"Y",1]
[90026,"EDENDALE",null,"Y",2]
[90026,"LOS ANGELES",null,"Y",3]
[90026,"SILVER LAKE",null,"Y",4]
[90027,"HOLLYWOOD",null,"Y",1]
[90027,"LOS ANGELES",null,"Y",2]
[90027,"LOS FELIZ",null,"Y",3]
[90028,"HOLLYWOOD",null,"Y",1]
[90028,"LOS ANGELES",null,"Y",2]
[90029,"LOS ANGELES",null,"Y",1]
[90029,"VERMONT",null,"Y",2]
[90030,"LOS ANGELES",null,"N",1]
[90031,"LINCOLN HEIGHTS",null,"Y",1]
[90031,"LOS ANGELES",null,"Y",3]
[90032,"EL SERENO",null,"Y",1]
[90032,"LOS ANGELES",null,"Y",2]
[90033,"BOYLE HEIGHTS",null,"Y",1]
[90033,"LOS ANGELES",null,"Y",2]
[90034,"LOS ANGELES",null,"Y",1]
[90034,"PALMS",null,"Y",2]
[90035,"LOS ANGELES",null,"Y",1]
[90035,"PREUSS",null,"Y",2]
[90036,"FARMERS MARKET",null,"Y",1]
[90036,"LOS ANGELES",null,"Y",2]
[90036,"MIRACLE MILE",null,"Y",3]
[90036,"WILSHIRE-LA BREA",null,"Y",4]
[90037,"GREEN",null,"Y",1]
[90037,"LOS ANGELES",null,"Y",2]
[90038,"HOLLYWOOD",null,"Y",1]
[90038,"LOS ANGELES",null,"Y",2]
[90038,"WEST HOLLYWOOD",null,"Y",3]
[90038,"WILCOX",null,"Y",4]
[90039,"GRIFFITH",null,"Y",1]
[90039,"LOS ANGELES",null,"Y",2]
[90040,"CITY OF COMMERCE",null,"Y",1]
[90040,"COMMERCE",null,"Y",3]
[90040,"LOS ANGELES",null,"Y",4]
[90041,"EAGLE ROCK",null,"Y",1]
[90041,"LOS ANGELES",null,"Y",2]
[90042,"HIGHLAND PARK",null,"Y",1]
[90042,"LOS ANGELES",null,"Y",2]
[90043,"LA TIJERA",null,"Y",1]
[90043,"LOS ANGELES",null,"Y",2]
[90043,"VIEW PARK",null,"Y",3]
[90043,"WINDSOR HILLS",null,"Y",4]
[90044,"HANCOCK",null,"Y",1]
[90044,"LOS ANGELES",null,"Y",2]
[90044,"WATTS",null,"Y",3]
[90045,"BRADLEY INTERNATIONAL",null,"Y",1]
[90045,"LOS ANGELES",null,"Y",2]
[90045,"WESTCHESTER",null,"Y",3]
[90046,"LOS ANGELES",null,"Y",1]
[90046,"WEST HOLLYWOOD",null,"Y",2]
[90047,"LOS ANGELES",null,"Y",1]
[90047,"WAGNER",null,"Y",2]
[90048,"BICENTENNIAL",null,"Y",1]
[90048,"BRIGGS",null,"Y",2]
[90048,"LOS ANGELES",null,"Y",3]
[90048,"WEST HOLLYWOOD",null,"Y",4]
[90049,"BARRINGTON",null,"Y",1]
[90049,"BARRINGTON",null,"Y",2]
[90049,"BRENTWOOD",null,"Y",3]
[90049,"LOS ANGELES",null,"Y",4]
[90050,"LOS ANGELES",null,"N",1]
[90051,"LOS ANGELES",null,"Y",1]
[90051,"WATTS",null,"Y",2]
[90052,"LOS ANGELES",null,"N",1]
[90053,"FEDERAL FINANCE",null,"Y",1]
[90053,"LOS ANGELES",null,"Y",2]
[90054,"LOS ANGELES",null,"N",1]
[90055,"LOS ANGELES",null,"N",1]
[90056,"BALDWIN HILLS",null,"Y",1]
[90056,"BALDWIN HILLS",null,"Y",1]
[90056,"CRENSHAW",null,"Y",2]
[90056,"LOS ANGELES",null,"Y",3]
[90056,"WINDSOR HILLS",null,"Y",4]
[90057,"FLINT",null,"Y",1]
[90057,"LOS ANGELES",null,"Y",2]
[90058,"LOS ANGELES",null,"Y",1]
[90058,"VERNON",null,"Y",2]
[90059,"GREENMEAD",null,"Y",1]
[90059,"LOS ANGELES",null,"Y",2]
[90059,"WATTS",null,"Y",3]
[90060,"LOS ANGELES",null,"N",1]
[90061,"LOS ANGELES",null,"Y",2]
[90061,"SOUTH",null,"Y",3]
[90061,"WATTS",null,"Y",3]
[90062,"LOS ANGELES",null,"Y",1]
[90062,"WESTVERN",null,"Y",2]
[90063,"HAZARD",null,"Y",1]
[90063,"LOS ANGELES",null,"Y",2]
[90064,"LOS ANGELES",null,"Y",1]
[90064,"RANCHO PARK",null,"Y",2]
[90065,"GLASSELL",null,"Y",1]
[90065,"GLASSELL PARK",null,"Y",2]
[90065,"LOS ANGELES",null,"Y",3]
[90066,"LOS ANGELES",null,"Y",1]
[90066,"MAR VISTA",null,"Y",2]
[90067,"CENTURY CITY",null,"Y",1]
[90067,"LOS ANGELES",null,"Y",2]
[90068,"HOLLYWOOD",null,"Y",1]
[90068,"LOS ANGELES",null,"Y",2]
[90069,"LOS ANGELES",null,"Y",1]
[90069,"WEST HOLLYWOOD",null,"Y",2]
[90070,"LOS ANGELES",null,"N",1]
[90071,"ARCO STATION",null,"Y",1]
[90071,"ARCO-PLAZA",null,"Y",2]
[90071,"LOS ANGELES",null,"Y",4]
[90072,"LOS ANGELES",null,"Y",1]
[90072,"SANTA WESTERN",null,"Y",2]
[90073,"LOS ANGELES",null,"Y",1]
[90073,"VETERANS ADMIN",null,"Y",3]
[90073,"VETERANS ADMINISTRATION",null,"Y",4]
[90074,"LOS ANGELES",null,"N",1]
[90075,"LOS ANGELES",null,"N",1]
[90076,"LOS ANGELES",null,"N",1]
[90077,"BARRINGTON",null,"Y",1]
[90077,"BARRINGTON",null,"Y",2]
[90077,"LOS ANGELES",null,"Y",3]
[90078,"HOLLYWOOD",null,"Y",1]
[90078,"LOS ANGELES",null,"Y",2]
[90079,"LOS ANGELES",null,"Y",1]
[90079,"TEXTILE BOXES",null,"Y",2]
[90080,"LOS ANGELES",null,"N",1]
[90081,"LOS ANGELES",null,"N",1]
[90082,"LOS ANGELES",null,"N",1]
[90083,"LOS ANGELES",null,"N",1]
[90084,"LOS ANGELES",null,"N",1]
[90086,"LOS ANGELES",null,"N",1]
[90087,"LOS ANGELES",null,"N",1]
[90088,"LOS ANGELES",null,"N",1]
[90089,"LOS ANGELES",null,"N",1]
[90091,"CITY OF COMMERCE",null,"Y",1]
[90091,"COMMERCE",null,"Y",2]
[90091,"LOS ANGELES",null,"Y",3]
[90093,"LOS ANGELES",null,"N",1]
[90094,"LOS ANGELES",null,"Y",1]
[90094,"PLAYA VISTA",null,"Y",2]
[90095,"LOS ANGELES",null,"N",1]
[90096,"LOS ANGELES",null,"N",1]
[90097,"LOS ANGELES",null,"N",1]
[90099,"BAR CODE TERM ANNEX",null,"Y",1]
[90099,"LOS ANGELES",null,"Y",2]
[90101,"BULK MAIL CENTER",null,"Y",1]
[90101,"LA",null,"Y",2]
[90101,"LOS ANGELES",null,"Y",3]
[90102,"LOS ANGELES",null,"N",1]
[90174,"LOS ANGELES",null,"N",1]
[90185,"LOS ANGELES",null,"N",1]
[90201,"BELL",null,"Y",1]
[90201,"BELL",null,"Y",1]
[90201,"BELL GARDENS",null,"Y",2]
[90201,"BELL GARDENS",null,"Y",2]
[90201,"CUDAHY",null,"Y",3]
[90202,"BELL",null,"Y",1]
[90202,"BELL",null,"Y",1]
[90202,"BELL GARDENS",null,"Y",2]
[90202,"BELL GARDENS",null,"Y",2]
[90209,"BEVERLY HILLS",null,"Y",1]
[90209,"BEVERLY HILLS",null,"Y",2]
[90210,"BEVERLY HILLS",null,"Y",1]
[90210,"BEVERLY HILLS",null,"Y",2]
[90211,"BEVERLY HILLS",null,"Y",1]
[90211,"BEVERLY HILLS",null,"Y",2]
[90212,"BEVERLY HILLS",null,"Y",1]
[90212,"BEVERLY HILLS",null,"Y",2]
[90213,"BEVERLY HILLS",null,"Y",1]
[90213,"BEVERLY HILLS",null,"Y",2]
[90220,"COMPTON",null,"Y",1]
[90220,"RANCHO DOMINGUEZ",null,"Y",2]
[90221,"COMPTON",null,"Y",1]
[90221,"EAST RANCHO DOMINGUEZ",null,"Y",2]
[90222,"COMPTON",null,"Y",1]
[90222,"ROSEWOOD",null,"Y",2]
[90223,"COMPTON",null,"N",1]
[90224,"COMPTON",null,"Y",1]
[90224,"RANCHO DOMINGUEZ",null,"Y",2]
[90230,"CULVER CITY",null,"N",1]
[90231,"CULVER CITY",null,"N",1]
[90232,"CULVER CITY",null,"N",1]
[90233,"CULVER CITY",null,"N",1]
[90239,"DOWNEY",null,"N",1]
[90240,"DOWNEY",null,"N",1]
[90241,"DOWNEY",null,"N",1]
[90242,"DOWNEY",null,"N",1]
[90245,"EL SEGUNDO",null,"N",1]
[90247,"GARDENA",null,"N",1]
[90248,"GARDENA",null,"N",1]
[90249,"GARDENA",null,"N",1]
[90250,"HAWTHORNE",null,"Y",1]
[90250,"HOLLY PARK",null,"Y",2]
[90251,"HAWTHORNE",null,"N",1]
[90254,"HERMOSA BEACH",null,"N",1]
[90255,"HUNTINGTON PARK",null,"Y",1]
[90255,"WALNUT PARK",null,"Y",2]
[90260,"LAWNDALE",null,"N",1]
[90261,"LAWNDALE",null,"N",1]
[90262,"LYNWOOD",null,"N",1]
[90263,"MALIBU",null,"N",1]
[90264,"MALIBU",null,"N",1]
[90265,"MALIBU",null,"N",1]
[90266,"MANHATTAN BEACH",null,"N",1]
[90267,"MANHATTAN BEACH",null,"N",1]
[90270,"BELL",null,"Y",1]
[90270,"BELL",null,"Y",2]
[90270,"MAYWOOD",null,"Y",3]
[90272,"PACIFIC PALISADES",null,"N",1]
[90274,"PALOS VERDES ESTATES",null,"Y",1]
[90274,"PALOS VERDES PENINSULA",null,"Y",2]
[90274,"PORTUGUESE BEND",null,"Y",5]
[90274,"ROLLING HILLS",null,"Y",7]
[90274,"ROLLING HILLS ESTATES",null,"Y",8]
[90275,"PALOS VERDES ESTATES",null,"Y",1]
[90275,"PALOS VERDES PENINSULA",null,"Y",2]
[90275,"RANCHO PALOS VERDES",null,"Y",5]
[90275,"ROLLING HILLS ESTATES",null,"Y",8]
[90277,"REDONDO BEACH",null,"N",1]
[90278,"REDONDO BEACH",null,"N",1]
[90280,"SOUTH GATE",null,"N",1]
[90290,"TOPANGA",null,"N",1]
[90291,"MARINA DEL REY",null,"Y",1]
[90291,"PLAYA DEL REY",null,"Y",2]
[90291,"VENICE",null,"Y",3]
[90292,"MARINA DEL REY",null,"Y",1]
[90292,"VENICE",null,"Y",2]
[90293,"PLAYA DEL REY",null,"Y",1]
[90293,"VENICE",null,"Y",2]
[90294,"VENICE",null,"N",1]
[90295,"MARINA DEL REY",null,"Y",1]
[90295,"VENICE",null,"Y",2]
[90296,"PLAYA DEL REY",null,"Y",1]
[90296,"VENICE",null,"Y",2]
[90301,"INGLEWOOD",null,"N",1]
[90302,"INGLEWOOD",null,"N",1]
[90303,"INGLEWOOD",null,"N",1]
[90304,"INGLEWOOD",null,"Y",1]
[90304,"LENNOX",null,"Y",2]
[90305,"INGLEWOOD",null,"N",1]
[90306,"INGLEWOOD",null,"N",1]
[90307,"INGLEWOOD",null,"N",1]
[90308,"INGLEWOOD",null,"N",1]
[90309,"INGLEWOOD",null,"N",1]
[90310,"INGLEWOOD",null,"N",1]
[90311,"INGLEWOOD",null,"N",1]
[90312,"INGLEWOOD",null,"N",1]
[90313,"INGLEWOOD",null,"N",1]
[90397,"INGLEWOOD",null,"N",1]
[90398,"INGLEWOOD",null,"N",1]
[90401,"SANTA MONICA",null,"N",1]
[90402,"SANTA MONICA",null,"N",1]
[90403,"SANTA MONICA",null,"N",1]
[90404,"SANTA MONICA",null,"N",1]
[90405,"SANTA MONICA",null,"N",1]
[90406,"SANTA MONICA",null,"N",1]
[90407,"SANTA MONICA",null,"N",1]
[90408,"SANTA MONICA",null,"N",1]
[90409,"SANTA MONICA",null,"N",1]
[90410,"SANTA MONICA",null,"N",1]
[90411,"SANTA MONICA",null,"N",1]
[90501,"TORRANCE",null,"N",1]
[90502,"TORRANCE",null,"N",1]
[90503,"TORRANCE",null,"N",1]
[90504,"TORRANCE",null,"N",1]
[90505,"TORRANCE",null,"N",1]
[90506,"TORRANCE",null,"N",1]
[90507,"TORRANCE",null,"N",1]
[90508,"TORRANCE",null,"N",1]
[90509,"TORRANCE",null,"N",1]
[90510,"TORRANCE",null,"N",1]
[90601,"WHITTIER",null,"N",1]
[90602,"WHITTIER",null,"N",1]
[90603,"WHITTIER",null,"N",1]
[90604,"WHITTIER",null,"N",1]
[90605,"SANTA FE SPRINGS",null,"Y",1]
[90605,"WHITTIER",null,"Y",2]
[90606,"LOS NIETOS",null,"Y",1]
[90606,"WHITTIER",null,"Y",2]
[90607,"WHITTIER",null,"N",1]
[90608,"WHITTIER",null,"N",1]
[90609,"WHITTIER",null,"N",1]
[90610,"LOS NIETOS",null,"Y",1]
[90610,"WHITTIER",null,"Y",2]
[90612,"WHITTIER",null,"N",1]
[90620,"BUENA PARK",null,"N",1]
[90621,"BUENA PARK",null,"N",1]
[90622,"BUENA PARK",null,"N",1]
[90623,"BUENA PARK",null,"Y",1]
[90623,"LA PALMA",null,"Y",2]
[90624,"BUENA PARK",null,"N",1]
[90630,"CYPRESS",null,"N",1]
[90631,"LA HABRA",null,"Y",1]
[90631,"LA HABRA HEIGHTS",null,"Y",2]
[90631,"LA HABRA HTS",null,"Y",3]
[90632,"LA HABRA",null,"N",1]
[90633,"LA HABRA",null,"N",1]
[90637,"LA MIRADA",null,"N",1]
[90638,"LA MIRADA",null,"Y",1]
[90638,"MIRADA",null,"Y",2]
[90639,"LA MIRADA",null,"N",1]
[90640,"MONTEBELLO",null,"N",1]
[90650,"NORWALK",null,"N",1]
[90651,"NORWALK",null,"N",1]
[90652,"NORWALK",null,"N",1]
[90659,"NORWALK",null,"N",1]
[90660,"PICO RIVERA",null,"N",1]
[90661,"PICO RIVERA",null,"N",1]
[90662,"PICO RIVERA",null,"N",1]
[90665,"PICO RIVERA",null,"N",1]
[90670,"SANTA FE SPRINGS",null,"N",1]
[90671,"SANTA FE SPRINGS",null,"N",1]
[90680,"STANTON",null,"N",1]
[90701,"ARTESIA",null,"Y",1]
[90701,"ARTESIA",null,"Y",1]
[90701,"CERRITOS",null,"Y",2]
[90702,"ARTESIA",null,"Y",1]
[90702,"ARTESIA",null,"Y",2]
[90703,"ARTESIA",null,"Y",1]
[90703,"ARTESIA",null,"Y",2]
[90703,"CERRITOS",null,"Y",3]
[90704,"AVALON",null,"Y",1]
[90704,"CATALINA",null,"Y",2]
[90704,"SANTA CATALINA",null,"Y",3]
[90706,"BELLFLOWER",null,"Y",1]
[90706,"BELLFLOWER",null,"Y",2]
[90707,"BELLFLOWER",null,"Y",1]
[90707,"BELLFLOWER",null,"Y",2]
[90710,"HARBOR CITY",null,"N",1]
[90711,"LAKEWOOD",null,"N",1]
[90712,"LAKEWOOD",null,"N",1]
[90713,"LAKEWOOD",null,"N",1]
[90714,"LAKEWOOD",null,"N",1]
[90715,"LAKEWOOD",null,"N",1]
[90716,"HAWAIIAN GARDENS",null,"Y",1]
[90716,"LAKEWOOD",null,"Y",2]
[90717,"LOMITA",null,"N",1]
[90720,"LOS ALAMITOS",null,"Y",1]
[90720,"ROSSMOOR",null,"Y",2]
[90721,"LOS ALAMITOS",null,"N",1]
[90723,"PARAMOUNT",null,"N",1]
[90731,"FORT MACARTHUR",null,"Y",1]
[90731,"FT MACARTHUR",null,"Y",1]
[90731,"SAN PEDRO",null,"Y",2]
[90731,"TERMINAL ISLAND",null,"Y",3]
[90732,"SAN PEDRO",null,"N",1]
[90733,"SAN PEDRO",null,"N",1]
[90734,"SAN PEDRO",null,"N",1]
[90740,"SEAL BEACH",null,"N",1]
[90742,"SUNSET BEACH",null,"N",1]
[90743,"SURFSIDE",null,"N",1]
[90744,"WILMINGTON",null,"N",1]
[90745,"CARSON",null,"Y",1]
[90745,"LONG BEACH",null,"Y",2]
[90746,"CARSON",null,"Y",1]
[90746,"LONG BEACH",null,"Y",2]
[90747,"C S U DOM HLS",null,"Y",1]
[90747,"CARSON",null,"Y",2]
[90747,"LONG BEACH",null,"Y",3]
[90748,"WILMINGTON",null,"N",1]
[90749,"CARSON",null,"Y",1]
[90749,"LONG BEACH",null,"Y",2]
[90801,"LONG BEACH",null,"N",1]
[90802,"LONG BEACH",null,"N",1]
[90803,"BELMONT SHORE",null,"Y",1]
[90803,"LONG BEACH",null,"Y",2]
[90803,"NAPLES",null,"Y",3]
[90804,"EAST LONG BEACH",null,"Y",1]
[90804,"LONG BEACH",null,"Y",2]
[90804,"SIGNAL HILL",null,"Y",3]
[90805,"LAKEWOOD",null,"Y",1]
[90805,"LONG BEACH",null,"Y",2]
[90805,"NORTH LONG BEACH",null,"Y",3]
[90806,"LONG BEACH",null,"Y",1]
[90806,"SIGNAL HILL",null,"Y",2]
[90807,"BIXBY KNOLLS",null,"Y",1]
[90807,"LONG BEACH",null,"Y",2]
[90807,"SIGNAL HILL",null,"Y",3]
[90808,"LONG BEACH",null,"N",1]
[90809,"LONG BEACH",null,"N",1]
[90810,"CABRILLO",null,"Y",1]
[90810,"CARSON",null,"Y",2]
[90810,"DOMINGUEZ",null,"Y",3]
[90810,"LONG BEACH",null,"Y",4]
[90813,"LONG BEACH",null,"N",1]
[90814,"LONG BEACH",null,"N",1]
[90815,"LONG BEACH",null,"N",1]
[90822,"LONG BEACH",null,"Y",1]
[90822,"LONG BEACH NAVAL SHIPYARD",null,"Y",2]
[90822,"LONG BEACH NAVAL STATION",null,"Y",2]
[90831,"LONG BEACH",null,"N",1]
[90832,"LONG BEACH",null,"N",1]
[90833,"LONG BEACH",null,"N",1]
[90834,"LONG BEACH",null,"N",1]
[90835,"LONG BEACH",null,"N",1]
[90840,"C S U LONG BEACH",null,"Y",1]
[90840,"LONG BEACH",null,"Y",2]
[90842,"LONG BEACH",null,"N",1]
[90844,"LONG BEACH",null,"N",1]
[90845,"LONG BEACH",null,"N",1]
[90846,"LONG BEACH",null,"N",1]
[90847,"LONG BEACH",null,"N",1]
[90848,"A A R P",null,"Y",1]
[90848,"LONG BEACH",null,"Y",2]
[90853,"LONG BEACH",null,"N",1]
[90888,"FAR",null,"Y",1]
[90888,"LONG BEACH",null,"Y",2]
[91001,"ALTADENA",null,"N",1]
[91003,"ALTADENA",null,"N",1]
[91006,"ARCADIA",null,"N",1]
[91007,"ARCADIA",null,"N",1]
[91009,"DUARTE",null,"N",1]
[91010,"BRADBURY",null,"Y",1]
[91010,"DUARTE",null,"Y",2]
[91011,"FLINTRIDGE",null,"Y",1]
[91011,"LA CANADA",null,"Y",2]
[91011,"LA CANADA FLINTRIDGE",null,"Y",3]
[91012,"LA CANADA",null,"Y",1]
[91012,"LA CANADA FLINTRIDGE",null,"Y",2]
[91016,"MONROVIA",null,"N",1]
[91017,"MONROVIA",null,"N",1]
[91020,"MONTROSE",null,"N",1]
[91021,"MONTROSE",null,"N",1]
[91023,"MOUNT WILSON",null,"N",1]
[91024,"SIERRA MADRE",null,"N",1]
[91025,"SIERRA MADRE",null,"N",1]
[91030,"SOUTH PASADENA",null,"N",1]
[91031,"SOUTH PASADENA",null,"N",1]
[91040,"SHADOW HILLS",null,"Y",1]
[91040,"SUNLAND",null,"Y",2]
[91041,"SUNLAND",null,"N",1]
[91042,"TUJUNGA",null,"N",1]
[91043,"TUJUNGA",null,"N",1]
[91046,"VERDUGO CITY",null,"N",1]
[91050,"PASADENA",null,"N",1]
[91051,"PASADENA",null,"N",1]
[91066,"ARCADIA",null,"N",1]
[91077,"ARCADIA",null,"N",1]
[91101,"PASADENA",null,"N",1]
[91102,"PASADENA",null,"N",1]
[91103,"PASADENA",null,"N",1]
[91104,"PASADENA",null,"N",1]
[91105,"PASADENA",null,"N",1]
[91106,"PASADENA",null,"N",1]
[91107,"PASADENA",null,"N",1]
[91108,"PASADENA",null,"Y",1]
[91108,"SAN MARINO",null,"Y",2]
[91109,"PASADENA",null,"N",1]
[91110,"PASADENA",null,"N",1]
[91114,"PASADENA",null,"N",1]
[91115,"PASADENA",null,"N",1]
[91116,"PASADENA",null,"N",1]
[91117,"PASADENA",null,"N",1]
[91118,"PASADENA",null,"Y",1]
[91118,"SAN MARINO",null,"Y",2]
[91121,"PASADENA",null,"N",1]
[91123,"PASADENA",null,"N",1]
[91124,"PASADENA",null,"N",1]
[91125,"PASADENA",null,"N",1]
[91126,"PASADENA",null,"N",1]
[91129,"PASADENA",null,"N",1]
[91131,"PASADENA",null,"N",1]
[91175,"PASADENA",null,"N",1]
[91182,"PASADENA",null,"N",1]
[91184,"PASADENA",null,"N",1]
[91185,"PASADENA",null,"N",1]
[91186,"PASADENA",null,"N",1]
[91187,"PASADENA",null,"N",1]
[91188,"PASADENA",null,"N",1]
[91189,"PASADENA",null,"N",1]
[91191,"PASADENA",null,"N",1]
[91201,"GLENDALE",null,"N",1]
[91202,"GLENDALE",null,"N",1]
[91203,"GLENDALE",null,"N",1]
[91204,"GLENDALE",null,"N",1]
[91205,"GLENDALE",null,"N",1]
[91206,"GLENDALE",null,"N",1]
[91207,"GLENDALE",null,"N",1]
[91208,"GLENDALE",null,"N",1]
[91209,"GLENDALE",null,"N",1]
[91210,"GLENDALE",null,"Y",1]
[91210,"GLENDALE GALLERIA",null,"Y",2]
[91214,"GLENDALE",null,"Y",1]
[91214,"LA CRESCENTA",null,"Y",2]
[91221,"GLENDALE",null,"N",1]
[91222,"GLENDALE",null,"N",1]
[91224,"GLENDALE",null,"Y",1]
[91224,"LA CRESCENTA",null,"Y",2]
[91225,"GLENDALE",null,"N",1]
[91226,"GLENDALE",null,"N",1]
[91301,"AGOURA",null,"Y",1]
[91301,"AGOURA HILLS",null,"Y",2]
[91301,"CALABASAS",null,"Y",4]
[91301,"CALABASAS HILLS",null,"Y",5]
[91301,"CORNELL",null,"Y",7]
[91301,"OAK PARK",null,"Y",8]
[91301,"SARATOGA HILLS",null,"Y",10]
[91302,"CALABASAS",null,"Y",1]
[91302,"HIDDEN HILLS",null,"Y",2]
[91302,"MONTE NIDO",null,"Y",3]
[91302,"WOODLAND HILLS",null,"Y",4]
[91303,"CANOGA PARK",null,"Y",1]
[91303,"WOODLAND HILLS",null,"Y",2]
[91304,"BOX CANYON",null,"Y",1]
[91304,"CANOGA PARK",null,"Y",2]
[91304,"WEST HILLS",null,"Y",3]
[91305,"CANOGA PARK",null,"N",1]
[91306,"CANOGA PARK",null,"Y",1]
[91306,"WINNETKA",null,"Y",2]
[91307,"BELL CANYON",null,"Y",1]
[91307,"CANOGA PARK",null,"Y",2]
[91307,"WEST HILLS",null,"Y",3]
[91308,"CANOGA PARK",null,"Y",1]
[91308,"WEST HILLS",null,"Y",2]
[91309,"CANOGA PARK",null,"N",1]
[91310,"CASTAIC",null,"Y",1]
[91310,"SANTA CLARITA",null,"Y",2]
[91311,"CHATSWORTH",null,"N",1]
[91312,"CHATSWORTH",null,"N",1]
[91313,"CHATSWORTH",null,"N",1]
[91316,"ENCINO",null,"Y",1]
[91316,"VAN NUYS",null,"Y",2]
[91319,"NEWBURY PARK",null,"Y",2]
[91319,"THOUSAND OAKS",null,"Y",2]
[91320,"NEWBURY PARK",null,"Y",1]
[91320,"THOUSAND OAKS",null,"Y",3]
[91321,"FRIENDLY VALLEY",null,"Y",1]
[91321,"NEWHALL",null,"Y",2]
[91321,"SANTA CLARITA",null,"Y",3]
[91322,"NEWHALL",null,"Y",1]
[91322,"SANTA CLARITA",null,"Y",2]
[91324,"NORTHRIDGE",null,"N",1]
[91325,"NORTHRIDGE",null,"N",1]
[91326,"NORTHRIDGE",null,"Y",1]
[91326,"PORTER RANCH",null,"Y",2]
[91327,"NORTHRIDGE",null,"Y",1]
[91327,"PORTER RANCH",null,"Y",2]
[91328,"NORTHRIDGE",null,"N",1]
[91329,"NORTHRIDGE",null,"N",1]
[91330,"NORTHRIDGE",null,"N",1]
[91331,"ARLETA",null,"Y",1]
[91331,"HANSEN HILLS",null,"Y",2]
[91331,"LOS ANGELES",null,"Y",4]
[91331,"PACOIMA",null,"Y",5]
[91333,"PACOIMA",null,"N",1]
[91334,"ARLETA",null,"Y",1]
[91334,"PACOIMA",null,"Y",2]
[91335,"ENCINO",null,"Y",1]
[91335,"LOS ANGELES",null,"Y",2]
[91335,"RESEDA",null,"Y",3]
[91335,"TARZANA",null,"Y",4]
[91337,"RESEDA",null,"N",1]
[91340,"SAN FERNANDO",null,"N",1]
[91341,"SAN FERNANDO",null,"N",1]
[91342,"KAGEL CANYON",null,"Y",1]
[91342,"LAKE VIEW TERRACE",null,"Y",2]
[91342,"SYLMAR",null,"Y",3]
[91343,"NORTH HILLS",null,"Y",1]
[91343,"NORTHRIDGE",null,"Y",2]
[91343,"SEPULVEDA",null,"Y",3]
[91344,"GRANADA HILLS",null,"Y",1]
[91344,"SAN FERNANDO",null,"Y",2]
[91345,"MISSION HILLS",null,"Y",1]
[91345,"SAN FERNANDO",null,"Y",2]
[91346,"MISSION HILLS",null,"Y",1]
[91346,"SAN FERNANDO",null,"Y",2]
[91350,"AGUA DULCE",null,"Y",1]
[91350,"BOUQUET CANYON",null,"Y",2]
[91350,"GREEN VALLEY",null,"Y",3]
[91350,"MINT CANYON",null,"Y",4]
[91350,"SANTA CLARITA",null,"Y",5]
[91350,"SAUGUS",null,"Y",6]
[91351,"CANYON COUNTRY",null,"Y",1]
[91351,"SANTA CLARITA",null,"Y",2]
[91352,"LA TUNA CANYON",null,"Y",1]
[91352,"RANCHO LA TUNA CANYON",null,"Y",2]
[91352,"SHADOW HILLS",null,"Y",3]
[91352,"SUN VALLEY",null,"Y",4]
[91353,"SUN VALLEY",null,"N",1]
[91354,"SANTA CLARITA",null,"Y",1]
[91354,"VALENCIA",null,"Y",2]
[91355,"SANTA CLARITA",null,"Y",1]
[91355,"VALENCIA",null,"Y",2]
[91356,"TARZANA",null,"N",1]
[91357,"TARZANA",null,"N",1]
[91358,"THOUSAND OAKS",null,"N",1]
[91359,"THOUSAND OAKS",null,"Y",1]
[91359,"WESTLAKE VILLAGE",null,"Y",2]
[91360,"THOUSAND OAKS",null,"N",1]
[91361,"HIDDEN VALLEY",null,"Y",1]
[91361,"LAKE SHERWOOD",null,"Y",2]
[91361,"THOUSAND OAKS",null,"Y",3]
[91361,"WESTLAKE VILLAGE",null,"Y",4]
[91362,"THOUSAND OAKS",null,"Y",1]
[91362,"WESTLAKE VILLAGE",null,"Y",2]
[91363,"THOUSAND OAKS",null,"Y",1]
[91363,"WESTLAKE VILLAGE",null,"Y",2]
[91364,"WOODLAND HILLS",null,"N",1]
[91365,"WOODLAND HILLS",null,"N",1]
[91367,"WOODLAND HILLS",null,"N",1]
[91371,"WOODLAND HILLS",null,"N",1]
[91372,"CALABASAS",null,"Y",1]
[91372,"WOODLAND HILLS",null,"Y",2]
[91376,"AGOURA",null,"Y",1]
[91376,"AGOURA HILLS",null,"Y",2]
[91380,"SANTA CLARITA",null,"Y",1]
[91380,"VALENCIA",null,"Y",2]
[91381,"NEWHALL",null,"Y",1]
[91381,"SANTA CLARITA",null,"Y",2]
[91381,"STEVENSON RANCH",null,"Y",3]
[91382,"NEWHALL",null,"Y",1]
[91382,"SANTA CLARITA",null,"Y",2]
[91383,"SANTA CLARITA",null,"N",1]
[91384,"CASTAIC",null,"Y",1]
[91384,"SANTA CLARITA",null,"Y",2]
[91384,"VAL VERDE",null,"Y",3]
[91385,"SANTA CLARITA",null,"Y",1]
[91385,"VALENCIA",null,"Y",2]
[91386,"CANYON COUNTRY",null,"Y",1]
[91386,"SANTA CLARITA",null,"Y",2]
[91388,"VAN NUYS",null,"N",1]
[91392,"SYLMAR",null,"N",1]
[91393,"NORTH HILLS",null,"Y",1]
[91393,"SEPULVEDA",null,"Y",2]
[91394,"GRANADA HILLS",null,"N",1]
[91395,"MISSION HILLS",null,"N",1]
[91396,"WINNETKA",null,"N",1]
[91399,"CALABASAS",null,"Y",1]
[91399,"WOODLAND HILLS",null,"Y",2]
[91401,"SHERMAN OAKS",null,"Y",1]
[91401,"VAN NUYS",null,"Y",2]
[91402,"PANORAMA CITY",null,"Y",1]
[91402,"VAN NUYS",null,"Y",2]
[91403,"SHERMAN OAKS",null,"Y",1]
[91403,"VAN NUYS",null,"Y",2]
[91404,"VAN NUYS",null,"N",1]
[91405,"VAN NUYS",null,"N",1]
[91406,"VAN NUYS",null,"N",1]
[91407,"VAN NUYS",null,"N",1]
[91408,"VAN NUYS",null,"N",1]
[91409,"VAN NUYS",null,"N",1]
[91410,"VAN NUYS",null,"N",1]
[91411,"SHERMAN OAKS",null,"Y",1]
[91411,"VAN NUYS",null,"Y",2]
[91412,"PANORAMA CITY",null,"Y",1]
[91412,"VAN NUYS",null,"Y",2]
[91413,"SHERMAN OAKS",null,"Y",1]
[91413,"VAN NUYS",null,"Y",2]
[91416,"ENCINO",null,"Y",1]
[91416,"VAN NUYS",null,"Y",2]
[91423,"SHERMAN OAKS",null,"Y",1]
[91423,"VAN NUYS",null,"Y",2]
[91426,"ENCINO",null,"Y",1]
[91426,"VAN NUYS",null,"Y",2]
[91436,"ENCINO",null,"Y",1]
[91436,"VAN NUYS",null,"Y",2]
[91470,"VAN NUYS",null,"N",1]
[91482,"VAN NUYS",null,"N",1]
[91495,"SHERMAN OAKS",null,"Y",1]
[91495,"VAN NUYS",null,"Y",2]
[91496,"VAN NUYS",null,"N",1]
[91497,"VAN NUYS",null,"N",1]
[91499,"VAN NUYS",null,"N",1]
[91501,"BURBANK",null,"Y",1]
[91501,"STARLIGHT HILLS",null,"Y",2]
[91502,"BURBANK",null,"N",1]
[91503,"BURBANK",null,"N",1]
[91504,"BURBANK",null,"N",1]
[91505,"BURBANK",null,"N",1]
[91506,"BURBANK",null,"N",1]
[91507,"BURBANK",null,"N",1]
[91508,"BURBANK",null,"N",1]
[91510,"BURBANK",null,"N",1]
[91521,"BURBANK",null,"N",1]
[91522,"BURBANK",null,"N",1]
[91523,"BURBANK",null,"N",1]
[91526,"BURBANK",null,"N",1]
[91601,"NORTH HOLLYWOOD",null,"N",1]
[91602,"NORTH HOLLYWOOD",null,"Y",1]
[91602,"STUDIO CITY",null,"Y",2]
[91602,"TOLUCA LAKE",null,"Y",3]
[91602,"WEST TOLUCA LAKE",null,"Y",4]
[91603,"NORTH HOLLYWOOD",null,"N",1]
[91604,"NORTH HOLLYWOOD",null,"Y",1]
[91604,"STUDIO CITY",null,"Y",2]
[91605,"NORTH HOLLYWOOD",null,"N",1]
[91606,"NORTH HOLLYWOOD",null,"N",1]
[91607,"N HOLLYWOOD",null,"Y",1]
[91607,"NORTH HOLLYWOOD",null,"Y",2]
[91607,"SHERMAN VILLAGE",null,"Y",3]
[91607,"STUDIO CITY",null,"Y",4]
[91607,"VALLEY VILLAGE",null,"Y",5]
[91608,"NORTH HOLLYWOOD",null,"Y",1]
[91608,"UNIVERSAL CITY",null,"Y",2]
[91609,"NORTH HOLLYWOOD",null,"N",1]
[91610,"NORTH HOLLYWOOD",null,"Y",1]
[91610,"TOLUCA LAKE",null,"Y",2]
[91611,"NORTH HOLLYWOOD",null,"N",1]
[91612,"NORTH HOLLYWOOD",null,"N",1]
[91614,"NORTH HOLLYWOOD",null,"Y",1]
[91614,"STUDIO CITY",null,"Y",2]
[91615,"NORTH HOLLYWOOD",null,"N",1]
[91616,"NORTH HOLLYWOOD",null,"N",1]
[91617,"NORTH HOLLYWOOD",null,"Y",1]
[91617,"VALLEY VILLAGE",null,"Y",2]
[91618,"NORTH HOLLYWOOD",null,"Y",1]
[91618,"UNIVERSAL CITY",null,"Y",2]
[91701,"ALTA LOMA",null,"Y",1]
[91701,"RANCHO CUCAMONGA",null,"Y",2]
[91702,"AZUSA",null,"N",1]
[91706,"BALDWIN PARK",null,"Y",1]
[91706,"BALDWIN PARK",null,"Y",2]
[91706,"IRWINDALE",null,"Y",3]
[91708,"CHINO",null,"N",1]
[91709,"CHINO",null,"Y",1]
[91709,"CHINO HILLS",null,"Y",2]
[91710,"CHINO",null,"N",1]
[91711,"CLAREMONT",null,"N",1]
[91714,"CITY OF INDUSTRY",null,"N",1]
[91715,"CITY OF INDUSTRY",null,"N",1]
[91716,"CITY OF INDUSTRY",null,"N",1]
[91718,"CORONA",null,"N",1]
[91719,"CORONA",null,"N",1]
[91720,"CORONA",null,"Y",1]
[91720,"FRONTERA",null,"Y",2]
[91722,"COVINA",null,"N",1]
[91723,"COVINA",null,"N",1]
[91724,"CHARTER OAK",null,"Y",1]
[91724,"COVINA",null,"Y",2]
[91729,"CUCAMONGA",null,"Y",1]
[91729,"RANCHO CUCAMONGA",null,"Y",2]
[91730,"CUCAMONGA",null,"Y",1]
[91730,"RANCHO CUCAMONGA",null,"Y",2]
[91731,"EL MONTE",null,"N",1]
[91732,"EL MONTE",null,"N",1]
[91733,"EL MONTE",null,"Y",1]
[91733,"SOUTH EL MONTE",null,"Y",2]
[91734,"EL MONTE",null,"N",1]
[91735,"EL MONTE",null,"N",1]
[91737,"ALTA LOMA",null,"Y",1]
[91737,"RANCHO CUCAMONGA",null,"Y",2]
[91739,"ETIWANDA",null,"Y",1]
[91739,"RANCHO CUCAMONGA",null,"Y",2]
[91740,"GLENDORA",null,"N",1]
[91741,"GLENDORA",null,"N",1]
[91743,"GUASTI",null,"N",1]
[91744,"CITY OF INDUSTRY",null,"Y",1]
[91744,"LA PUENTE",null,"Y",2]
[91745,"CITY OF INDUSTRY",null,"Y",1]
[91745,"HACIENDA HEIGHTS",null,"Y",2]
[91745,"LA PUENTE",null,"Y",3]
[91746,"BASSETT",null,"Y",1]
[91746,"CITY OF INDUSTRY",null,"Y",2]
[91746,"LA PUENTE",null,"Y",3]
[91747,"LA PUENTE",null,"N",1]
[91748,"CITY OF INDUSTRY",null,"Y",1]
[91748,"LA PUENTE",null,"Y",2]
[91748,"ROWLAND HEIGHTS",null,"Y",3]
[91749,"LA PUENTE",null,"N",1]
[91750,"LA VERNE",null,"N",1]
[91752,"MIRA LOMA",null,"N",1]
[91754,"MONTEREY PARK",null,"N",1]
[91755,"MONTEREY PARK",null,"N",1]
[91756,"MONTEREY PARK",null,"N",1]
[91758,"ONTARIO",null,"N",1]
[91759,"MT BALDY",null,"N",1]
[91760,"NORCO",null,"N",1]
[91761,"ONTARIO",null,"N",1]
[91762,"ONTARIO",null,"N",1]
[91763,"MONTCLAIR",null,"N",1]
[91764,"ONTARIO",null,"N",1]
[91765,"DIAMOND BAR",null,"Y",1]
[91765,"POMONA",null,"Y",2]
[91766,"PHILLIPS RANCH",null,"Y",1]
[91766,"POMONA",null,"Y",2]
[91767,"POMONA",null,"N",1]
[91768,"POMONA",null,"N",1]
[91769,"POMONA",null,"N",1]
[91770,"ROSEMEAD",null,"Y",1]
[91770,"SOUTH SAN GABRIEL",null,"Y",2]
[91771,"ROSEMEAD",null,"N",1]
[91772,"ROSEMEAD",null,"N",1]
[91773,"SAN DIMAS",null,"N",1]
[91775,"SAN GABRIEL",null,"N",1]
[91776,"SAN GABRIEL",null,"N",1]
[91778,"SAN GABRIEL",null,"N",1]
[91780,"TEMPLE CITY",null,"N",1]
[91784,"UPLAND",null,"N",1]
[91785,"UPLAND",null,"N",1]
[91786,"UPLAND",null,"N",1]
[91788,"WALNUT",null,"N",1]
[91789,"WALNUT",null,"N",1]
[91790,"WEST COVINA",null,"N",1]
[91791,"WEST COVINA",null,"N",1]
[91792,"WEST COVINA",null,"N",1]
[91793,"WEST COVINA",null,"N",1]
[91795,"WALNUT",null,"N",1]
[91797,"BALDWIN PARK",null,"Y",1]
[91797,"BALDWIN PARK",null,"Y",2]
[91798,"ONTARIO",null,"N",1]
[91799,"POMONA",null,"N",1]
[91801,"ALHAMBRA",null,"N",1]
[91802,"ALHAMBRA",null,"N",1]
[91803,"ALHAMBRA",null,"N",1]
[91804,"ALHAMBRA",null,"N",1]
[91841,"ALHAMBRA",null,"N",1]
[91896,"ALHAMBRA",null,"N",1]
[91899,"ALHAMBRA",null,"Y",1]
[91899,"CITY OF INDUSTRY",null,"Y",2]
[91901,"ALPINE",null,"N",1]
[91902,"BONITA",null,"N",1]
[91903,"ALPINE",null,"N",1]
[91905,"BOULEVARD",null,"N",1]
[91906,"CAMPO",null,"N",1]
[91908,"BONITA",null,"N",1]
[91909,"CHULA VISTA",null,"N",1]
[91910,"CHULA VISTA",null,"N",1]
[91911,"CHULA VISTA",null,"N",1]
[91912,"CHULA VISTA",null,"N",1]
[91913,"CHULA VISTA",null,"N",1]
[91914,"CHULA VISTA",null,"N",1]
[91915,"CHULA VISTA",null,"N",1]
[91916,"DESCANSO",null,"N",1]
[91917,"DULZURA",null,"N",1]
[91921,"CHULA VISTA",null,"N",1]
[91931,"GUATAY",null,"N",1]
[91932,"IMPERIAL BEACH",null,"N",1]
[91933,"IMPERIAL BEACH",null,"N",1]
[91934,"JACUMBA",null,"N",1]
[91935,"JAMUL",null,"N",1]
[91941,"LA MESA",null,"N",1]
[91942,"LA MESA",null,"N",1]
[91943,"LA MESA",null,"N",1]
[91944,"LA MESA",null,"N",1]
[91945,"LEMON GROVE",null,"N",1]
[91946,"LEMON GROVE",null,"N",1]
[91947,"LINCOLN ACRES",null,"N",1]
[91948,"MOUNT LAGUNA",null,"N",1]
[91950,"NATIONAL CITY",null,"N",1]
[91951,"NATIONAL CITY",null,"N",1]
[91962,"PINE VALLEY",null,"N",1]
[91963,"POTRERO",null,"N",1]
[91976,"SPRING VALLEY",null,"N",1]
[91977,"SPRING VALLEY",null,"N",1]
[91978,"SPRING VALLEY",null,"N",1]
[91979,"SPRING VALLEY",null,"N",1]
[91980,"TECATE",null,"N",1]
[91987,"CAMPO",null,"Y",1]
[91987,"TECATE",null,"Y",2]
[91990,"POTRERO",null,"N",1]
[92003,"BONSALL",null,"N",1]
[92004,"BORREGO SPRINGS",null,"N",1]
[92007,"CARDIFF",null,"Y",1]
[92007,"CARDIFF BY THE SEA",null,"Y",2]
[92008,"CARLSBAD",null,"N",1]
[92009,"CARLSBAD",null,"N",1]
[92014,"DEL MAR",null,"N",1]
[92018,"CARLSBAD",null,"N",1]
[92019,"EL CAJON",null,"N",1]
[92020,"EL CAJON",null,"N",1]
[92021,"BOSTONIA",null,"Y",1]
[92021,"CREST",null,"Y",2]
[92021,"EL CAJON",null,"Y",3]
[92022,"EL CAJON",null,"N",1]
[92023,"ENCINITAS",null,"N",1]
[92024,"ENCINITAS",null,"Y",1]
[92024,"LEUCADIA",null,"Y",2]
[92024,"OLIVENHAIN",null,"Y",3]
[92025,"ESCONDIDO",null,"N",1]
[92026,"ESCONDIDO",null,"N",1]
[92027,"ESCONDIDO",null,"N",1]
[92028,"FALLBROOK",null,"Y",1]
[92028,"RAINBOW",null,"Y",2]
[92029,"ESCONDIDO",null,"N",1]
[92030,"ESCONDIDO",null,"N",1]
[92033,"ESCONDIDO",null,"N",1]
[92036,"JULIAN",null,"N",1]
[92037,"LA JOLLA",null,"N",1]
[92038,"LA JOLLA",null,"N",1]
[92039,"LA JOLLA",null,"N",1]
[92040,"LAKESIDE",null,"N",1]
[92046,"ESCONDIDO",null,"N",1]
[92049,"OCEANSIDE",null,"N",1]
[92051,"OCEANSIDE",null,"N",1]
[92052,"OCEANSIDE",null,"N",1]
[92054,"OCEANSIDE",null,"N",1]
[92055,"CAMP PENDLETON",null,"Y",1]
[92055,"OCEANSIDE",null,"Y",2]
[92056,"OCEANSIDE",null,"N",1]
[92057,"OCEANSIDE",null,"N",1]
[92058,"OCEANSIDE",null,"N",1]
[92059,"PALA",null,"N",1]
[92060,"PALOMAR MOUNTAIN",null,"N",1]
[92061,"PALA",null,"Y",1]
[92061,"PAUMA VALLEY",null,"Y",2]
[92064,"POWAY",null,"N",1]
[92065,"RAMONA",null,"N",1]
[92066,"RANCHITA",null,"Y",1]
[92066,"WARNER SPRINGS",null,"Y",2]
[92067,"RANCHO SANTA FE",null,"N",1]
[92068,"SAN LUIS REY",null,"N",1]
[92069,"SAN MARCOS",null,"N",1]
[92070,"SANTA YSABEL",null,"N",1]
[92071,"SANTEE",null,"N",1]
[92072,"SANTEE",null,"N",1]
[92074,"POWAY",null,"N",1]
[92075,"SOLANA BEACH",null,"N",1]
[92079,"SAN MARCOS",null,"N",1]
[92082,"VALLEY CENTER",null,"N",1]
[92083,"VISTA",null,"N",1]
[92084,"VISTA",null,"N",1]
[92085,"VISTA",null,"N",1]
[92086,"WARNER SPRINGS",null,"N",1]
[92088,"FALLBROOK",null,"N",1]
[92090,"EL CAJON",null,"N",1]
[92091,"RANCHO SANTA FE",null,"N",1]
[92092,"LA JOLLA",null,"N",1]
[92093,"LA JOLLA",null,"N",1]
[92096,"SAN MARCOS",null,"N",1]
[92101,"SAN DIEGO",null,"N",1]
[92102,"SAN DIEGO",null,"N",1]
[92103,"SAN DIEGO",null,"N",1]
[92104,"SAN DIEGO",null,"N",1]
[92105,"SAN DIEGO",null,"N",1]
[92106,"SAN DIEGO",null,"N",1]
[92107,"OCEAN BEACH",null,"Y",1]
[92107,"SAN DIEGO",null,"Y",2]
[92108,"SAN DIEGO",null,"N",1]
[92109,"PACIFIC BEACH",null,"Y",1]
[92109,"SAN DIEGO",null,"Y",2]
[92110,"SAN DIEGO",null,"N",1]
[92111,"SAN DIEGO",null,"N",1]
[92112,"SAN DIEGO",null,"N",1]
[92113,"SAN DIEGO",null,"N",1]
[92114,"SAN DIEGO",null,"N",1]
[92115,"SAN DIEGO",null,"N",1]
[92116,"SAN DIEGO",null,"N",1]
[92117,"SAN DIEGO",null,"N",1]
[92118,"CORONADO",null,"Y",1]
[92118,"SAN DIEGO",null,"Y",2]
[92119,"SAN DIEGO",null,"N",1]
[92120,"SAN DIEGO",null,"N",1]
[92121,"SAN DIEGO",null,"N",1]
[92122,"SAN DIEGO",null,"N",1]
[92123,"SAN DIEGO",null,"N",1]
[92124,"SAN DIEGO",null,"N",1]
[92126,"SAN DIEGO",null,"N",1]
[92127,"SAN DIEGO",null,"N",1]
[92128,"RANCHO BERNARDO",null,"Y",1]
[92128,"SAN DIEGO",null,"Y",2]
[92129,"SAN DIEGO",null,"N",1]
[92130,"SAN DIEGO",null,"N",1]
[92131,"SAN DIEGO",null,"N",1]
[92132,"SAN DIEGO",null,"N",1]
[92133,"SAN DIEGO",null,"N",1]
[92134,"SAN DIEGO",null,"N",1]
[92135,"SAN DIEGO",null,"N",1]
[92136,"SAN DIEGO",null,"N",1]
[92137,"SAN DIEGO",null,"N",1]
[92138,"SAN DIEGO",null,"N",1]
[92139,"PARADISE HILLS",null,"Y",1]
[92139,"SAN DIEGO",null,"Y",2]
[92140,"SAN DIEGO",null,"N",1]
[92142,"SAN DIEGO",null,"N",1]
[92143,"SAN DIEGO",null,"Y",1]
[92143,"SAN YSIDRO",null,"Y",2]
[92145,"SAN DIEGO",null,"N",1]
[92147,"SAN DIEGO",null,"N",1]
[92149,"SAN DIEGO",null,"N",1]
[92150,"SAN DIEGO",null,"N",1]
[92152,"SAN DIEGO",null,"N",1]
[92153,"NESTOR",null,"Y",1]
[92153,"SAN DIEGO",null,"Y",2]
[92154,"SAN DIEGO",null,"N",1]
[92155,"SAN DIEGO",null,"N",1]
[92158,"SAN DIEGO",null,"N",1]
[92159,"SAN DIEGO",null,"N",1]
[92160,"SAN DIEGO",null,"N",1]
[92161,"SAN DIEGO",null,"N",1]
[92162,"SAN DIEGO",null,"N",1]
[92163,"SAN DIEGO",null,"N",1]
[92164,"SAN DIEGO",null,"N",1]
[92165,"SAN DIEGO",null,"N",1]
[92166,"SAN DIEGO",null,"N",1]
[92167,"SAN DIEGO",null,"N",1]
[92168,"SAN DIEGO",null,"N",1]
[92169,"SAN DIEGO",null,"N",1]
[92170,"SAN DIEGO",null,"N",1]
[92171,"SAN DIEGO",null,"N",1]
[92172,"SAN DIEGO",null,"N",1]
[92173,"SAN DIEGO",null,"Y",1]
[92173,"SAN YSIDRO",null,"Y",2]
[92174,"SAN DIEGO",null,"N",1]
[92175,"SAN DIEGO",null,"N",1]
[92176,"SAN DIEGO",null,"N",1]
[92177,"SAN DIEGO",null,"N",1]
[92178,"CORONADO",null,"Y",1]
[92178,"SAN DIEGO",null,"Y",2]
[92179,"SAN DIEGO",null,"N",1]
[92182,"SAN DIEGO",null,"Y",1]
[92182,"SAN DIEGO STATE UNIVERSITY",null,"Y",2]
[92184,"SAN DIEGO",null,"N",1]
[92186,"SAN DIEGO",null,"N",1]
[92187,"SAN DIEGO",null,"N",1]
[92190,"SAN DIEGO",null,"N",1]
[92191,"SAN DIEGO",null,"N",1]
[92192,"SAN DIEGO",null,"N",1]
[92193,"SAN DIEGO",null,"N",1]
[92194,"SAN DIEGO",null,"N",1]
[92195,"SAN DIEGO",null,"N",1]
[92196,"SAN DIEGO",null,"N",1]
[92197,"SAN DIEGO",null,"N",1]
[92198,"SAN DIEGO",null,"N",1]
[92199,"SAN DIEGO",null,"N",1]
[92201,"BERMUDA DUNES",null,"Y",1]
[92201,"CABAZON INDIAN RESERVATION",null,"Y",2]
[92201,"CHIRIACO SMT",null,"Y",3]
[92201,"CHIRIACO SUMMIT",null,"Y",4]
[92201,"INDIO",null,"Y",5]
[92202,"INDIO",null,"N",1]
[92203,"INDIO",null,"N",1]
[92210,"INDIAN WELLS",null,"Y",1]
[92210,"PALM DESERT",null,"Y",2]
[92211,"PALM DESERT",null,"N",1]
[92220,"BANNING",null,"N",1]
[92222,"BARD",null,"N",1]
[92223,"BEAUMONT",null,"Y",1]
[92223,"CHERRY VALLEY",null,"Y",2]
[92225,"BLYTHE",null,"Y",1]
[92225,"EAST BLYTHE",null,"Y",2]
[92225,"MESA VERDE",null,"Y",3]
[92225,"RIPLEY",null,"Y",4]
[92226,"BLYTHE",null,"N",1]
[92227,"BRAWLEY",null,"N",1]
[92230,"CABAZON",null,"N",1]
[92231,"CALEXICO",null,"Y",1]
[92231,"MOUNT SIGNAL",null,"Y",2]
[92232,"CALEXICO",null,"N",1]
[92233,"CALIPATRIA",null,"N",1]
[92234,"CATHEDRAL CITY",null,"N",1]
[92235,"CATHEDRAL CITY",null,"N",1]
[92236,"COACHELLA",null,"N",1]
[92239,"DESERT CENTER",null,"Y",1]
[92239,"EAGLE MOUNTAIN",null,"Y",2]
[92240,"DESERT HOT SPRINGS",null,"N",1]
[92241,"DESERT HOT SPRINGS",null,"Y",1]
[92241,"SKY VALLEY",null,"Y",2]
[92242,"BIG RIVER",null,"Y",1]
[92242,"EARP",null,"Y",2]
[92243,"EL CENTRO",null,"N",1]
[92244,"EL CENTRO",null,"N",1]
[92249,"HEBER",null,"N",1]
[92250,"BONDS CORNER",null,"Y",1]
[92250,"HOLTVILLE",null,"Y",2]
[92251,"IMPERIAL",null,"N",1]
[92252,"JOSHUA TREE",null,"N",1]
[92253,"LA QUINTA",null,"N",1]
[92254,"MECCA",null,"N",1]
[92255,"PALM DESERT",null,"N",1]
[92256,"MORONGO VALLEY",null,"N",1]
[92257,"BOMBAY BEACH",null,"Y",1]
[92257,"NILAND",null,"Y",2]
[92258,"N PALM SPGS",null,"Y",1]
[92258,"N PALM SPRINGS",null,"Y",2]
[92258,"NO PALM SPRINGS",null,"Y",3]
[92258,"NORTH PALM SPRINGS",null,"Y",4]
[92259,"OCOTILLO",null,"N",1]
[92260,"PALM DESERT",null,"N",1]
[92261,"PALM DESERT",null,"N",1]
[92262,"BARONA RANCHERIA",null,"Y",1]
[92262,"PALM SPRINGS",null,"Y",2]
[92262,"PALM SPRINGS MUNICIPAL AIRPO",null,"Y",3]
[92262,"SMOKE TREE",null,"Y",4]
[92263,"PALM SPRINGS",null,"N",1]
[92264,"PALM SPRINGS",null,"N",1]
[92266,"PALO VERDE",null,"N",1]
[92267,"BLACK MEADOW LANDING",null,"Y",1]
[92267,"PARKER DAM",null,"Y",2]
[92268,"PIONEERTOWN",null,"Y",1]
[92268,"RIMROCK",null,"Y",2]
[92270,"RANCHO MIRAGE",null,"N",1]
[92273,"SEELEY",null,"N",1]
[92274,"100 PALMS",null,"Y",1]
[92274,"ONE HUNDRED PALMS",null,"Y",2]
[92274,"SANDY KORNER",null,"Y",3]
[92274,"THERMAL",null,"Y",4]
[92274,"TORRES MARTINEZ INDIAN RESER",null,"Y",5]
[92274,"VALERIE",null,"Y",6]
[92275,"SALTON CITY",null,"Y",1]
[92275,"THERMAL",null,"Y",2]
[92276,"1000 PALMS",null,"Y",1]
[92276,"THOUSAND PALMS",null,"Y",2]
[92277,"29 PALMS",null,"Y",1]
[92277,"TWENTYNINE PALMS",null,"Y",2]
[92278,"29 PALMS",null,"Y",1]
[92278,"MARINE CORPS BASE",null,"Y",2]
[92278,"TWENTYNINE PALMS",null,"Y",3]
[92278,"TWENTYNINE PALMS MARINE CORP",null,"Y",4]
[92278,"TWENTYNINE PALMS MCB",null,"Y",5]
[92280,"BLYTHE",null,"Y",1]
[92280,"VIDAL",null,"Y",2]
[92280,"VIDAL JUNCTION",null,"Y",3]
[92281,"WESTMORLAND",null,"N",1]
[92282,"BONNIE BELL",null,"Y",1]
[92282,"CABAZON",null,"Y",2]
[92282,"SNOW CREEK",null,"Y",3]
[92282,"WEST PALM SPRINGS",null,"Y",4]
[92282,"WHITE WATER",null,"Y",5]
[92283,"FELICITY",null,"Y",1]
[92283,"WINTERHAVEN",null,"Y",2]
[92284,"YUCCA VALLEY",null,"N",1]
[92285,"JOHNSON VALLEY",null,"Y",1]
[92285,"LANDERS",null,"Y",2]
[92285,"YUCCA VALLEY",null,"Y",3]
[92286,"YUCCA VALLEY",null,"N",1]
[92292,"PALM SPRINGS",null,"N",1]
[92301,"ADELANTO",null,"N",1]
[92304,"AMBOY",null,"Y",1]
[92304,"BAGDAD",null,"Y",2]
[92304,"SALTUS",null,"Y",3]
[92305,"ANGELUS OAKS",null,"Y",1]
[92305,"SEVEN OAKS",null,"Y",2]
[92307,"APPLE VALLEY",null,"N",1]
[92308,"APPLE VALLEY",null,"N",1]
[92309,"BAKER",null,"Y",1]
[92309,"BAKER",null,"Y",2]
[92309,"HALLORAN SPRINGS",null,"Y",3]
[92309,"KELSO",null,"Y",4]
[92310,"BARSTOW",null,"Y",1]
[92310,"BARSTOW",null,"Y",2]
[92310,"FORT IRWIN",null,"Y",3]
[92311,"BARSTOW",null,"Y",1]
[92311,"BARSTOW",null,"Y",2]
[92311,"HODGE",null,"Y",3]
[92312,"BARSTOW",null,"Y",1]
[92312,"BARSTOW",null,"Y",2]
[92313,"GRAND TERRACE",null,"N",1]
[92314,"BIG BEAR CITY",null,"Y",1]
[92314,"BIG BEAR CITY",null,"Y",2]
[92315,"BIG BEAR",null,"Y",1]
[92315,"BIG BEAR LAKE",null,"Y",2]
[92316,"BLOOMINGTON",null,"Y",1]
[92316,"CRESTMORE",null,"Y",2]
[92317,"BLUE JAY",null,"N",1]
[92318,"BRYN MAWR",null,"N",1]
[92319,"CADIZ",null,"Y",1]
[92319,"CHAMBLESS",null,"Y",2]
[92320,"CALIMESA",null,"N",1]
[92321,"CEDAR GLEN",null,"N",1]
[92322,"CEDARPINES PARK",null,"N",1]
[92323,"CIMA",null,"N",1]
[92324,"COLTON",null,"Y",1]
[92324,"GRAND TERRACE",null,"Y",2]
[92325,"CRESTLINE",null,"Y",1]
[92325,"LAKE GREGORY",null,"Y",2]
[92325,"VALLEY OF ENCHANTMENT",null,"Y",3]
[92326,"CREST PARK",null,"N",1]
[92327,"DAGGETT",null,"N",1]
[92328,"DEATH VALLEY",null,"Y",1]
[92328,"DEATH VALLEY JCT",null,"Y",2]
[92328,"DEATH VALLEY JUNCTION",null,"Y",3]
[92328,"STOVE PIPE WELLS",null,"Y",4]
[92329,"PHELAN",null,"N",1]
[92332,"ESSEX",null,"Y",1]
[92332,"GOFFS",null,"Y",2]
[92333,"FAWNSKIN",null,"N",1]
[92334,"FONTANA",null,"N",1]
[92335,"FONTANA",null,"N",1]
[92336,"FONTANA",null,"N",1]
[92337,"FONTANA",null,"N",1]
[92338,"LUDLOW",null,"Y",1]
[92338,"NEWBERRY SPRINGS",null,"Y",2]
[92339,"FALLSVALE",null,"Y",1]
[92339,"FOREST FALLS",null,"Y",2]
[92340,"HESPERIA",null,"N",1]
[92341,"GREEN VALLEY LAKE",null,"N",1]
[92342,"HELENDALE",null,"Y",1]
[92342,"SILVER LAKES",null,"Y",2]
[92345,"HESPERIA",null,"Y",1]
[92345,"OAK HILLS",null,"Y",2]
[92346,"EAST HIGHLAND",null,"Y",1]
[92346,"HIGHLAND",null,"Y",2]
[92346,"SAN MANUEL INDIAN RESERVATIO",null,"Y",3]
[92347,"HINKLEY",null,"Y",1]
[92347,"LOCKHART",null,"Y",2]
[92350,"LOMA LINDA",null,"N",1]
[92352,"LAKE ARROWHEAD",null,"N",1]
[92354,"LOMA LINDA",null,"Y",1]
[92354,"NORTH LOMA LINDA",null,"Y",2]
[92356,"LUCERNE VALLEY",null,"N",1]
[92357,"LOMA LINDA",null,"N",1]
[92358,"LYTLE CREEK",null,"N",1]
[92359,"MENTONE",null,"Y",1]
[92359,"MOUNTAIN HOME VILLAGE",null,"Y",2]
[92363,"CHEMEHUEVI",null,"Y",1]
[92363,"CHEMEHUEVI VALLEY",null,"Y",2]
[92363,"NEEDLES",null,"Y",3]
[92364,"BAKER",null,"Y",1]
[92364,"BAKER",null,"Y",2]
[92364,"NIPTON",null,"Y",3]
[92365,"NEWBERRY SPRINGS",null,"N",1]
[92366,"MOUNTAIN PASS",null,"N",1]
[92368,"ORO GRANDE",null,"N",1]
[92369,"PATTON",null,"N",1]
[92371,"PHELAN",null,"N",1]
[92372,"PINON HILLS",null,"N",1]
[92373,"MARIGOLD",null,"Y",1]
[92373,"REDLANDS",null,"Y",2]
[92373,"SMILEY HEIGHTS",null,"Y",3]
[92374,"REDLANDS",null,"N",1]
[92375,"REDLANDS",null,"N",1]
[92376,"RIALTO",null,"N",1]
[92377,"RIALTO",null,"N",1]
[92378,"RIMFOREST",null,"N",1]
[92382,"ARROWBEAR LAKE",null,"Y",1]
[92382,"RUNNING SPRINGS",null,"Y",2]
[92384,"SHOSHONE",null,"N",1]
[92385,"SKYFOREST",null,"N",1]
[92386,"BIG BEAR CITY",null,"Y",1]
[92386,"BIG BEAR CITY",null,"Y",2]
[92386,"SUGARLOAF",null,"Y",3]
[92389,"TECOPA",null,"Y",1]
[92389,"TECOPA HOT SPRINGS",null,"Y",2]
[92391,"TWIN PEAKS",null,"N",1]
[92392,"BALDY MESA",null,"Y",1]
[92392,"SPRING VALLEY LAKE",null,"Y",2]
[92392,"VICTORVILLE",null,"Y",3]
[92393,"VICTORVILLE",null,"N",1]
[92394,"VICTORVILLE",null,"N",1]
[92397,"WRIGHTWOOD",null,"N",1]
[92398,"YERMO",null,"N",1]
[92399,"DUNLAP ACRES",null,"Y",1]
[92399,"OAK GLEN",null,"Y",2]
[92399,"YUCAIPA",null,"Y",3]
[92401,"SAN BERNARDINO",null,"N",1]
[92402,"SAN BERNARDINO",null,"N",1]
[92403,"SAN BERNARDINO",null,"N",1]
[92404,"SAN BERNARDINO",null,"N",1]
[92405,"SAN BERNARDINO",null,"N",1]
[92406,"SAN BERNARDINO",null,"N",1]
[92407,"ARROWHEAD FARMS",null,"Y",1]
[92407,"CAJON JUNCTION",null,"Y",2]
[92407,"DEVORE HEIGHTS",null,"Y",3]
[92407,"MUSCOY",null,"Y",4]
[92407,"SAN BERNARDINO",null,"Y",5]
[92408,"SAN BERNARDINO",null,"N",1]
[92410,"BASE LINE",null,"Y",1]
[92410,"SAN BERNARDINO",null,"Y",2]
[92411,"SAN BERNARDINO",null,"N",1]
[92412,"SAN BERNARDINO",null,"N",1]
[92413,"SAN BERNARDINO",null,"N",1]
[92414,"SAN BERNARDINO",null,"N",1]
[92415,"SAN BERNARDINO",null,"N",1]
[92416,"SAN BERNARDINO",null,"N",1]
[92418,"SAN BERNARDINO",null,"N",1]
[92420,"SAN BERNARDINO",null,"N",1]
[92423,"SAN BERNARDINO",null,"N",1]
[92424,"SAN BERNARDINO",null,"N",1]
[92427,"SAN BERNARDINO",null,"N",1]
[92501,"RIVERSIDE",null,"N",1]
[92502,"RIVERSIDE",null,"N",1]
[92503,"RIVERSIDE",null,"N",1]
[92504,"CASA BLANCA",null,"Y",1]
[92504,"HARDMAN CENTER",null,"Y",2]
[92504,"RIVERSIDE",null,"Y",3]
[92505,"ARLANZA VILLAGE",null,"Y",1]
[92505,"RIVERSIDE",null,"Y",2]
[92506,"RIVERSIDE",null,"N",1]
[92507,"BOX SPRINGS",null,"Y",1]
[92507,"CANYON CREST",null,"Y",2]
[92507,"RIVERSIDE",null,"Y",3]
[92508,"RIVERSIDE",null,"N",1]
[92509,"BELLTOWN",null,"Y",1]
[92509,"CRESTMORE HEIGHTS",null,"Y",2]
[92509,"INDIAN HILLS",null,"Y",3]
[92509,"JURUPA",null,"Y",4]
[92509,"RIVERSIDE",null,"Y",5]
[92509,"RUBIDOUX",null,"Y",6]
[92509,"SUNNYSLOPE",null,"Y",7]
[92513,"RIVERSIDE",null,"N",1]
[92514,"RIVERSIDE",null,"N",1]
[92515,"RIVERSIDE",null,"N",1]
[92516,"RIVERSIDE",null,"N",1]
[92517,"RIVERSIDE",null,"N",1]
[92518,"ARNOLD HEIGHTS",null,"Y",1]
[92518,"MARCH AFB",null,"Y",2]
[92518,"MARCH AIR FORCE BASE",null,"Y",3]
[92518,"RIVERSIDE",null,"Y",4]
[92519,"RIVERSIDE",null,"N",1]
[92521,"RIVERSIDE",null,"N",1]
[92522,"RIVERSIDE",null,"N",1]
[92530,"LAKE ELSINORE",null,"N",1]
[92531,"LAKE ELSINORE",null,"N",1]
[92532,"LAKE ELSINORE",null,"N",1]
[92536,"AGUANGA",null,"Y",1]
[92536,"HOLCOMB VILLAGE",null,"Y",2]
[92539,"ANZA",null,"N",1]
[92543,"HEMET",null,"N",1]
[92544,"HEMET",null,"N",1]
[92545,"HEMET",null,"N",1]
[92546,"HEMET",null,"N",1]
[92548,"HOMELAND",null,"N",1]
[92549,"IDYLLWILD",null,"N",1]
[92551,"MORENO VALLEY",null,"N",1]
[92552,"MORENO VALLEY",null,"N",1]
[92553,"MORENO VALLEY",null,"N",1]
[92554,"MORENO VALLEY",null,"N",1]
[92555,"MORENO VALLEY",null,"N",1]
[92556,"MORENO VALLEY",null,"N",1]
[92557,"MORENO VALLEY",null,"N",1]
[92561,"MOUNTAIN CENTER",null,"Y",1]
[92561,"PINYON PINES",null,"Y",2]
[92562,"MURRIETA",null,"Y",1]
[92562,"MURRIETA HOT SPRINGS",null,"Y",2]
[92563,"MURRIETA",null,"Y",1]
[92563,"MURRIETA HOT SPRINGS",null,"Y",2]
[92564,"MURRIETA",null,"Y",1]
[92564,"MURRIETA HOT SPRINGS",null,"Y",2]
[92567,"LAKEVIEW",null,"Y",1]
[92567,"NUEVO",null,"Y",2]
[92570,"PERRIS",null,"N",1]
[92571,"PERRIS",null,"N",1]
[92572,"PERRIS",null,"N",1]
[92581,"SAN JACINTO",null,"N",1]
[92582,"SAN JACINTO",null,"N",1]
[92583,"GILMAN HOT SPRINGS",null,"Y",1]
[92583,"SAN JACINTO",null,"Y",2]
[92583,"SOBOBA HOT SPRINGS",null,"Y",3]
[92583,"SOBOBA INDIAN RESERVATION",null,"Y",4]
[92584,"MENIFEE",null,"Y",1]
[92584,"SUN CITY",null,"Y",2]
[92585,"ROMOLAND",null,"Y",1]
[92585,"SUN CITY",null,"Y",2]
[92586,"SUN CITY",null,"N",1]
[92587,"CANYON LAKE",null,"Y",1]
[92587,"QUAIL VALLEY",null,"Y",2]
[92587,"SUN CITY",null,"Y",3]
[92589,"RANCHO CALIFORNIA",null,"Y",1]
[92589,"TEMECULA",null,"Y",2]
[92590,"RANCHO CALIFORNIA",null,"Y",1]
[92590,"TEMECULA",null,"Y",2]
[92591,"RANCHO CALIFORNIA",null,"Y",1]
[92591,"TEMECULA",null,"Y",2]
[92592,"RANCHO CALIFORNIA",null,"Y",1]
[92592,"TEMECULA",null,"Y",2]
[92593,"RANCHO CALIFORNIA",null,"Y",1]
[92593,"TEMECULA",null,"Y",2]
[92595,"WILDOMAR",null,"N",1]
[92596,"WINCHESTER",null,"N",1]
[92599,"PERRIS",null,"N",1]
[92602,"IRVINE",null,"N",1]
[92603,"IRVINE",null,"N",1]
[92604,"IRVINE",null,"N",1]
[92605,"CENTER AVE",null,"Y",1]
[92605,"HUNTINGTON BEACH",null,"Y",2]
[92606,"IRVINE",null,"N",1]
[92607,"LAGUNA BEACH",null,"Y",1]
[92607,"LAGUNA NIGUEL",null,"Y",2]
[92610,"EL TORO",null,"Y",1]
[92610,"FOOTHILL RANCH",null,"Y",2]
[92612,"IRVINE",null,"N",1]
[92614,"IRVINE",null,"N",1]
[92615,"HUNTINGTON BEACH",null,"N",1]
[92616,"IRVINE",null,"N",1]
[92618,"IRVINE",null,"N",1]
[92619,"IRVINE",null,"N",1]
[92620,"IRVINE",null,"N",1]
[92623,"IRVINE",null,"N",1]
[92624,"CAPISTRANO BEACH",null,"Y",1]
[92624,"DANA POINT",null,"Y",2]
[92625,"CORONA DEL MAR",null,"N",1]
[92626,"COSTA MESA",null,"N",1]
[92627,"COSTA MESA",null,"Y",1]
[92627,"MESA CENTER",null,"Y",2]
[92628,"COSTA MESA",null,"N",1]
[92629,"DANA POINT",null,"Y",1]
[92629,"MONARCH BAY",null,"Y",2]
[92629,"MONARCH BEACH",null,"Y",3]
[92630,"EL TORO",null,"Y",1]
[92630,"LAKE FOREST",null,"Y",2]
[92646,"HUNTINGTON",null,"Y",1]
[92646,"HUNTINGTON BEACH",null,"Y",2]
[92647,"HUNTINGTON BEACH",null,"N",1]
[92648,"BEACH CENTER",null,"Y",1]
[92648,"HUNTINGTON BEACH",null,"Y",2]
[92649,"HUNTINGTON BEACH",null,"N",1]
[92650,"EAST IRVINE",null,"Y",1]
[92650,"IRVINE",null,"Y",2]
[92651,"ALISO VIEJO",null,"Y",1]
[92651,"LAGUNA BEACH",null,"Y",2]
[92651,"LAGUNA NIGUEL",null,"Y",3]
[92651,"SOUTH LAGUNA",null,"Y",4]
[92652,"LAGUNA BEACH",null,"Y",1]
[92652,"PLAYA",null,"Y",2]
[92653,"ALISO VIEJO",null,"Y",1]
[92653,"LAGUNA BEACH",null,"Y",2]
[92653,"LAGUNA HILLS",null,"Y",3]
[92653,"LEISURE WORLD",null,"Y",4]
[92654,"LAGUNA BEACH",null,"Y",1]
[92654,"LAGUNA HILLS",null,"Y",2]
[92655,"MIDWAY CITY",null,"N",1]
[92656,"ALISO VIEJO",null,"Y",1]
[92656,"LAGUNA BEACH",null,"Y",2]
[92656,"LAGUNA HILLS",null,"Y",3]
[92656,"LAGUNA NIGUEL",null,"Y",4]
[92657,"NEWPORT BEACH",null,"Y",1]
[92657,"NEWPORT COAST",null,"Y",2]
[92658,"NEWPORT BEACH",null,"N",1]
[92659,"NEWPORT BEACH",null,"N",1]
[92660,"NEWPORT BEACH",null,"N",1]
[92661,"NEWPORT BEACH",null,"N",1]
[92662,"NEWPORT BEACH",null,"N",1]
[92663,"NEWPORT BEACH",null,"N",1]
[92672,"SAN CLEMENTE",null,"Y",1]
[92672,"VISTA DEL MAR",null,"Y",2]
[92673,"SAN CLEMENTE",null,"N",1]
[92674,"SAN CLEMENTE",null,"N",1]
[92675,"MISSION VIEJO",null,"Y",1]
[92675,"SAN JUAN CAPISTRANO",null,"Y",2]
[92676,"MODJESKA",null,"Y",1]
[92676,"MODJESKA CANYON",null,"Y",2]
[92676,"SILVERADO",null,"Y",3]
[92677,"LAGUNA BEACH",null,"Y",1]
[92677,"LAGUNA NIGUEL",null,"Y",2]
[92677,"SOUTH LAGUNA",null,"Y",3]
[92677,"SOUTH LAGUNA BEACH",null,"Y",4]
[92678,"TRABUCO CANYON",null,"N",1]
[92679,"COTO DE CAZA",null,"Y",1]
[92679,"DOVE CANYON",null,"Y",2]
[92679,"PORTOLA HILLS",null,"Y",3]
[92679,"ROBINSON RANCH",null,"Y",4]
[92679,"TRABUCO",null,"Y",6]
[92679,"TRABUCO CANYON",null,"Y",7]
[92679,"TRABUCO CYN",null,"Y",7]
[92683,"WESTMINSTER",null,"N",1]
[92684,"WESTMINSTER",null,"N",1]
[92685,"WESTMINSTER",null,"N",1]
[92688,"RANCHO SANTA MARGARITA",null,"Y",1]
[92688,"TRABUCO CANYON",null,"Y",7]
[92690,"MISSION VIEJO",null,"Y",1]
[92690,"SAN JUAN CAPISTRANO",null,"Y",2]
[92691,"MISSION VIEJO",null,"Y",1]
[92691,"SAN JUAN CAPISTRANO",null,"Y",2]
[92692,"MISSION VIEJO",null,"Y",1]
[92692,"SAN JUAN CAPISTRANO",null,"Y",2]
[92693,"SAN JUAN CAPISTRANO",null,"Y",1]
[92697,"IRVINE",null,"Y",1]
[92697,"UCI",null,"Y",2]
[92698,"ALISO VIEJO",null,"Y",1]
[92701,"SANTA ANA",null,"N",1]
[92702,"SANTA ANA",null,"N",1]
[92703,"BRISTOL",null,"Y",1]
[92703,"SANTA ANA",null,"Y",2]
[92704,"DIAMOND",null,"Y",1]
[92704,"SANTA ANA",null,"Y",2]
[92705,"COWAN HEIGHTS",null,"Y",1]
[92705,"INDUSTRIAL",null,"Y",2]
[92705,"SANTA ANA",null,"Y",3]
[92706,"KING",null,"Y",1]
[92706,"SANTA ANA",null,"Y",2]
[92707,"SANTA ANA",null,"Y",1]
[92707,"SANTA ANA HEIGHTS",null,"Y",2]
[92707,"SOUTH MAIN",null,"Y",3]
[92708,"FOUNTAIN VALLEY",null,"Y",1]
[92708,"SANTA ANA",null,"Y",2]
[92709,"EL TORO M C A S",null,"Y",1]
[92709,"EL TORO MARINE CORPS AIR",null,"Y",2]
[92709,"IRVINE",null,"Y",3]
[92709,"SANTA ANA",null,"Y",4]
[92709,"SN ANA",null,"Y",5]
[92710,"IRVINE",null,"Y",1]
[92710,"SANTA ANA",null,"Y",2]
[92710,"SN ANA",null,"Y",3]
[92710,"TUSTIN MARINE CORPS AIR S",null,"Y",4]
[92711,"SANTA ANA",null,"N",1]
[92712,"SANTA ANA",null,"N",1]
[92728,"FOUNTAIN VALLEY",null,"Y",1]
[92728,"SANTA ANA",null,"Y",2]
[92735,"SANTA ANA",null,"N",1]
[92780,"TUSTIN",null,"N",1]
[92781,"TUSTIN",null,"N",1]
[92782,"TUSTIN",null,"N",1]
[92799,"SANTA ANA",null,"N",1]
[92801,"ANAHEIM",null,"N",1]
[92802,"ANAHEIM",null,"Y",1]
[92802,"HOLIDAY",null,"Y",2]
[92803,"ANAHEIM",null,"N",1]
[92804,"ANAHEIM",null,"Y",1]
[92804,"BROOKHURST CENTER",null,"Y",2]
[92805,"ANAHEIM",null,"Y",1]
[92805,"FEDERAL",null,"Y",2]
[92806,"ANAHEIM",null,"Y",1]
[92806,"SUNKIST",null,"Y",2]
[92807,"ANAHEIM",null,"Y",1]
[92807,"ANAHEIM HILLS",null,"Y",2]
[92808,"ANAHEIM",null,"Y",1]
[92808,"ANAHEIM HILLS",null,"Y",2]
[92811,"ATWOOD",null,"N",1]
[92812,"ANAHEIM",null,"N",1]
[92814,"ANAHEIM",null,"N",1]
[92815,"ANAHEIM",null,"N",1]
[92816,"ANAHEIM",null,"N",1]
[92817,"ANAHEIM",null,"Y",1]
[92817,"ANAHEIM HILLS",null,"Y",2]
[92821,"BREA",null,"N",1]
[92822,"BREA",null,"N",1]
[92823,"BREA",null,"N",1]
[92825,"ANAHEIM",null,"N",1]
[92831,"FULLERTON",null,"N",1]
[92832,"FULLERTON",null,"N",1]
[92833,"FULLERTON",null,"N",1]
[92834,"FULLERTON",null,"N",1]
[92835,"FULLERTON",null,"N",1]
[92836,"FULLERTON",null,"N",1]
[92837,"FULLERTON",null,"N",1]
[92838,"FULLERTON",null,"N",1]
[92840,"GARDEN GROVE",null,"N",1]
[92841,"GARDEN GROVE",null,"N",1]
[92842,"GARDEN GROVE",null,"N",1]
[92843,"GARDEN GROVE",null,"N",1]
[92844,"GARDEN GROVE",null,"N",1]
[92845,"GARDEN GROVE",null,"N",1]
[92846,"GARDEN GROVE",null,"N",1]
[92850,"ANAHEIM",null,"N",1]
[92856,"ORANGE",null,"N",1]
[92857,"ORANGE",null,"N",1]
[92859,"ORANGE",null,"N",1]
[92861,"ORANGE",null,"Y",1]
[92861,"VILLA PARK",null,"Y",2]
[92862,"ORANGE",null,"N",1]
[92863,"ORANGE",null,"N",1]
[92864,"ORANGE",null,"N",1]
[92865,"ORANGE",null,"N",1]
[92866,"ORANGE",null,"N",1]
[92867,"ORANGE",null,"Y",1]
[92867,"VILLA PARK",null,"Y",2]
[92868,"ORANGE",null,"N",1]
[92869,"ORANGE",null,"N",1]
[92870,"PLACENTIA",null,"N",1]
[92871,"PLACENTIA",null,"N",1]
[92885,"YORBA LINDA",null,"N",1]
[92886,"YORBA LINDA",null,"N",1]
[92887,"YORBA LINDA",null,"N",1]
[92899,"ANAHEIM",null,"N",1]
[93001,"CASITAS SPRINGS",null,"Y",1]
[93001,"VENTURA",null,"Y",2]
[93002,"VENTURA",null,"N",1]
[93003,"VENTURA",null,"N",1]
[93004,"VENTURA",null,"N",1]
[93005,"VENTURA",null,"N",1]
[93006,"VENTURA",null,"N",1]
[93007,"VENTURA",null,"N",1]
[93009,"VENTURA",null,"N",1]
[93010,"CAMARILLO",null,"N",1]
[93011,"CAMARILLO",null,"N",1]
[93012,"CAMARILLO",null,"Y",1]
[93012,"SANTA ROSA VALLEY",null,"Y",2]
[93013,"CARPINTERIA",null,"N",1]
[93014,"CARPINTERIA",null,"N",1]
[93015,"FILLMORE",null,"N",1]
[93016,"FILLMORE",null,"N",1]
[93020,"MOORPARK",null,"N",1]
[93021,"MOORPARK",null,"N",1]
[93022,"OAK VIEW",null,"N",1]
[93023,"MEINERS OAKS",null,"Y",1]
[93023,"OJAI",null,"Y",2]
[93024,"OJAI",null,"N",1]
[93030,"OXNARD",null,"N",1]
[93031,"OXNARD",null,"N",1]
[93032,"OXNARD",null,"N",1]
[93033,"OXNARD",null,"N",1]
[93034,"OXNARD",null,"N",1]
[93035,"OXNARD",null,"N",1]
[93040,"PIRU",null,"N",1]
[93041,"POINT MUGU NAWC",null,"Y",1]
[93041,"PORT HUENEME",null,"Y",2]
[93042,"POINT MUGU NAWC",null,"Y",3]
[93042,"PORT HUENEME",null,"Y",4]
[93043,"PORT HUENEME",null,"Y",2]
[93043,"PORT HUENEME CBC BASE",null,"Y",3]
[93043,"PORT HUENEME NAVAL CONSTRUCT",null,"Y",4]
[93044,"PORT HUENEME",null,"Y",1]
[93044,"PORT HUENEME CBC BASE",null,"Y",2]
[93060,"SANTA PAULA",null,"N",1]
[93061,"SANTA PAULA",null,"N",1]
[93062,"SIMI VALLEY",null,"N",1]
[93063,"SANTA SUSANA",null,"Y",1]
[93063,"SIMI VALLEY",null,"Y",2]
[93064,"BRANDEIS",null,"Y",1]
[93064,"SIMI VALLEY",null,"Y",2]
[93065,"SIMI VALLEY",null,"N",1]
[93066,"SOMIS",null,"N",1]
[93067,"SUMMERLAND",null,"N",1]
[93093,"SIMI VALLEY",null,"N",1]
[93099,"SIMI VALLEY",null,"N",1]
[93101,"SANTA BARBARA",null,"N",1]
[93102,"SANTA BARBARA",null,"N",1]
[93103,"SANTA BARBARA",null,"N",1]
[93105,"SANTA BARBARA",null,"N",1]
[93106,"SANTA BARBARA",null,"Y",1]
[93106,"UNIV OF CA SANTA BARBARA",null,"Y",2]
[93107,"SANTA BARBARA",null,"Y",1]
[93107,"UCSB STUDENT DORM BOXES",null,"Y",2]
[93108,"MONTECITO",null,"Y",1]
[93108,"SANTA BARBARA",null,"Y",2]
[93109,"SANTA BARBARA",null,"N",1]
[93110,"GOLETA",null,"Y",1]
[93110,"SANTA BARBARA",null,"Y",2]
[93111,"GOLETA",null,"Y",1]
[93111,"SANTA BARBARA",null,"Y",2]
[93116,"GOLETA",null,"Y",1]
[93116,"SANTA BARBARA",null,"Y",2]
[93117,"GAVIOTA",null,"Y",1]
[93117,"GOLETA",null,"Y",2]
[93117,"ISLA VISTA",null,"Y",3]
[93117,"SANTA BARBARA",null,"Y",4]
[93118,"GOLETA",null,"Y",1]
[93118,"SANTA BARBARA",null,"Y",2]
[93120,"SANTA BARBARA",null,"N",1]
[93121,"SANTA BARBARA",null,"N",1]
[93130,"SANTA BARBARA",null,"N",1]
[93140,"SANTA BARBARA",null,"N",1]
[93150,"SANTA BARBARA",null,"N",1]
[93160,"GOLETA",null,"Y",1]
[93160,"SANTA BARBARA",null,"Y",2]
[93190,"SANTA BARBARA",null,"N",1]
[93199,"GOLETA",null,"Y",1]
[93199,"SANTA BARBARA",null,"Y",2]
[93201,"ALPAUGH",null,"N",1]
[93202,"ARMONA",null,"N",1]
[93203,"ARVIN",null,"Y",1]
[93203,"DI GIORGIO",null,"Y",2]
[93204,"AVENAL",null,"N",1]
[93205,"BODFISH",null,"N",1]
[93206,"BUTTONWILLOW",null,"N",1]
[93207,"CALIFORNIA HOT SPRINGS",null,"N",1]
[93208,"CAMP NELSON",null,"Y",1]
[93208,"SPRINGVILLE",null,"Y",2]
[93210,"COALINGA",null,"N",1]
[93212,"CORCORAN",null,"N",1]
[93215,"DELANO",null,"N",1]
[93216,"DELANO",null,"N",1]
[93218,"DUCOR",null,"N",1]
[93219,"EARLIMART",null,"N",1]
[93220,"EDISON",null,"N",1]
[93221,"EXETER",null,"N",1]
[93222,"FRAZIER PARK",null,"Y",1]
[93222,"PINE MOUNTAIN CLUB",null,"Y",2]
[93223,"FARMERSVILLE",null,"N",1]
[93224,"FELLOWS",null,"N",1]
[93225,"FRAZIER PARK",null,"N",1]
[93226,"GLENNVILLE",null,"N",1]
[93227,"GOSHEN",null,"N",1]
[93230,"HANFORD",null,"N",1]
[93231,"HANFORD",null,"N",1]
[93232,"HANFORD",null,"N",1]
[93234,"HURON",null,"N",1]
[93235,"IVANHOE",null,"N",1]
[93237,"KAWEAH",null,"N",1]
[93238,"KERNVILLE",null,"Y",1]
[93238,"RIVER KERN",null,"Y",2]
[93239,"KETTLEMAN CITY",null,"N",1]
[93240,"LAKE ISABELLA",null,"Y",1]
[93240,"MOUNTAIN MESA",null,"Y",2]
[93241,"LAMONT",null,"N",1]
[93242,"LATON",null,"N",1]
[93243,"GORMAN",null,"Y",1]
[93243,"LEBEC",null,"Y",2]
[93244,"LEMON COVE",null,"N",1]
[93245,"LEMOORE",null,"Y",1]
[93245,"LEMOORE NAVAL AIR STATION",null,"Y",2]
[93246,"LEMOORE",null,"N",1]
[93247,"CAIRNS CORNER",null,"Y",1]
[93247,"LINDSAY",null,"Y",2]
[93247,"TONYVILLE",null,"Y",3]
[93249,"LOST HILLS",null,"N",1]
[93250,"MC FARLAND",null,"N",1]
[93251,"MC KITTRICK",null,"N",1]
[93252,"MARICOPA",null,"N",1]
[93254,"CUYAMA",null,"Y",1]
[93254,"NEW CUYAMA",null,"Y",2]
[93255,"ONYX",null,"N",1]
[93256,"PIXLEY",null,"N",1]
[93257,"PORTERVILLE",null,"N",1]
[93258,"PORTERVILLE",null,"N",1]
[93260,"BALANCE ROCK",null,"Y",1]
[93260,"POSEY",null,"Y",2]
[93261,"RICHGROVE",null,"N",1]
[93262,"SEQUOIA NATIONAL PARK",null,"N",1]
[93263,"SHAFTER",null,"N",1]
[93265,"SPRINGVILLE",null,"N",1]
[93266,"STRATFORD",null,"N",1]
[93267,"STRATHMORE",null,"N",1]
[93268,"TAFT",null,"N",1]
[93270,"TERRA BELLA",null,"N",1]
[93271,"THREE RIVERS",null,"N",1]
[93272,"TIPTON",null,"N",1]
[93274,"TULARE",null,"N",1]
[93275,"TULARE",null,"N",1]
[93276,"TUPMAN",null,"N",1]
[93277,"VISALIA",null,"N",1]
[93278,"VISALIA",null,"N",1]
[93279,"VISALIA",null,"N",1]
[93280,"POND",null,"Y",1]
[93280,"WASCO",null,"Y",2]
[93282,"CORCORAN",null,"Y",1]
[93282,"WAUKENA",null,"Y",2]
[93283,"WELDON",null,"N",1]
[93285,"WOFFORD HEIGHTS",null,"N",1]
[93286,"ELDERWOOD",null,"Y",1]
[93286,"WOODLAKE",null,"Y",2]
[93287,"WOODY",null,"N",1]
[93291,"VISALIA",null,"N",1]
[93292,"VISALIA",null,"N",1]
[93301,"BAKERSFIELD",null,"Y",1]
[93301,"BAKERSFIELD",null,"Y",2]
[93302,"BAKERSFIELD",null,"Y",1]
[93302,"BAKERSFIELD",null,"Y",2]
[93303,"BAKERSFIELD",null,"Y",1]
[93303,"BAKERSFIELD",null,"Y",2]
[93304,"BAKERSFIELD",null,"Y",1]
[93304,"BAKERSFIELD",null,"Y",2]
[93305,"BAKERSFIELD",null,"Y",1]
[93305,"BAKERSFIELD",null,"Y",2]
[93305,"EAST BAKERSFIELD",null,"Y",3]
[93306,"BAKERSFIELD",null,"Y",1]
[93306,"BAKERSFIELD",null,"Y",2]
[93306,"HILLCREST CENTER",null,"Y",3]
[93307,"BAKERSFIELD",null,"Y",1]
[93307,"BAKERSFIELD",null,"Y",2]
[93307,"BRUNDAGE",null,"Y",3]
[93307,"HILLTOP",null,"Y",4]
[93307,"VISTA PARK",null,"Y",5]
[93308,"BAKERSFIELD",null,"Y",1]
[93308,"BAKERSFIELD",null,"Y",2]
[93308,"FRUITVALE",null,"Y",3]
[93308,"MEADOWS FIELD",null,"Y",4]
[93308,"OILDALE",null,"Y",5]
[93309,"BAKERSFIELD",null,"Y",1]
[93309,"BAKERSFIELD",null,"Y",2]
[93309,"STOCKDALE",null,"Y",3]
[93311,"BAKERSFIELD",null,"Y",1]
[93311,"BAKERSFIELD",null,"Y",2]
[93312,"BAKERSFIELD",null,"Y",1]
[93312,"BAKERSFIELD",null,"Y",2]
[93312,"CALDORS CORNER",null,"Y",3]
[93312,"GREELEY",null,"Y",4]
[93312,"GREENACRES",null,"Y",5]
[93313,"BAKERSFIELD",null,"Y",1]
[93313,"BAKERSFIELD",null,"Y",2]
[93313,"PUMPKIN CENTER",null,"Y",3]
[93380,"BAKERSFIELD",null,"Y",1]
[93380,"BAKERSFIELD",null,"Y",2]
[93381,"BAKERSFIELD",null,"Y",1]
[93381,"BAKERSFIELD",null,"Y",2]
[93381,"METTLER",null,"Y",3]
[93382,"BAKERSFIELD",null,"Y",1]
[93382,"BAKERSFIELD",null,"Y",2]
[93382,"DEL KERN",null,"Y",3]
[93383,"BAKERSFIELD",null,"Y",1]
[93383,"BAKERSFIELD",null,"Y",2]
[93383,"PUMPKIN CENTER",null,"Y",3]
[93384,"BAKERSFIELD",null,"Y",1]
[93384,"BAKERSFIELD",null,"Y",2]
[93385,"BAKERSFIELD",null,"Y",1]
[93385,"BAKERSFIELD",null,"Y",2]
[93386,"BAKERSFIELD",null,"Y",1]
[93386,"BAKERSFIELD",null,"Y",2]
[93387,"BAKERSFIELD",null,"Y",1]
[93387,"BAKERSFIELD",null,"Y",2]
[93388,"BAKERSFIELD",null,"Y",1]
[93388,"BAKERSFIELD",null,"Y",2]
[93389,"BAKERSFIELD",null,"Y",1]
[93389,"BAKERSFIELD",null,"Y",2]
[93390,"BAKERSFIELD",null,"Y",1]
[93390,"BAKERSFIELD",null,"Y",2]
[93401,"SAN LUIS OBISPO",null,"N",1]
[93402,"BAYWOOD PARK",null,"Y",1]
[93402,"LOS OSOS",null,"Y",2]
[93402,"SAN LUIS OBISPO",null,"Y",3]
[93403,"SAN LUIS OBISPO",null,"N",1]
[93405,"SAN LUIS OBISPO",null,"N",1]
[93406,"SAN LUIS OBISPO",null,"N",1]
[93407,"CAL POLY UNIVERSITY",null,"Y",1]
[93407,"SAN LUIS OBISPO",null,"Y",2]
[93408,"SAN LUIS OBISPO",null,"Y",1]
[93408,"SLO COUNTY GOVT CTR",null,"Y",2]
[93409,"CALIFORNIA MENS COLONY SLO",null,"Y",1]
[93409,"SAN LUIS OBISPO",null,"Y",2]
[93410,"CAL POLY STUDENT DORMS",null,"Y",1]
[93410,"SAN LUIS OBISPO",null,"Y",2]
[93412,"LOS OSOS",null,"Y",1]
[93412,"SAN LUIS OBISPO",null,"Y",2]
[93420,"ARROYO GRANDE",null,"Y",1]
[93420,"ARROYO GRANDE",null,"Y",2]
[93420,"HALCYON",null,"Y",3]
[93421,"ARROYO GRANDE",null,"Y",1]
[93421,"ARROYO GRANDE",null,"Y",2]
[93422,"ATASCADERO",null,"Y",1]
[93422,"ATASCADERO",null,"Y",2]
[93423,"ATASCADERO",null,"Y",1]
[93423,"ATASCADERO",null,"Y",2]
[93424,"AVILA BEACH",null,"N",1]
[93426,"BRADLEY",null,"N",1]
[93427,"BUELLTON",null,"N",1]
[93428,"CAMBRIA",null,"N",1]
[93429,"CASMALIA",null,"N",1]
[93430,"CAYUCOS",null,"N",1]
[93432,"CRESTON",null,"N",1]
[93433,"GROVER BEACH",null,"N",1]
[93434,"GUADALUPE",null,"N",1]
[93435,"HARMONY",null,"N",1]
[93436,"LOMPOC",null,"Y",1]
[93436,"VANDENBERG VILLAGE",null,"Y",2]
[93437,"LOMPOC",null,"Y",1]
[93437,"VANDENBERG AFB",null,"Y",2]
[93437,"VANDENBERG AIR FORCE BASE",null,"Y",3]
[93438,"LOMPOC",null,"N",1]
[93440,"LOS ALAMOS",null,"N",1]
[93441,"LOS OLIVOS",null,"N",1]
[93442,"MORRO BAY",null,"N",1]
[93443,"MORRO BAY",null,"N",1]
[93444,"NIPOMO",null,"N",1]
[93445,"OCEANO",null,"N",1]
[93446,"ADELAIDE",null,"Y",1]
[93446,"PASO ROBLES",null,"Y",2]
[93447,"PASO ROBLES",null,"N",1]
[93448,"PISMO BEACH",null,"N",1]
[93449,"PISMO BEACH",null,"N",1]
[93450,"SAN ARDO",null,"N",1]
[93451,"CAMP ROBERTS",null,"Y",1]
[93451,"PARKFIELD",null,"Y",2]
[93451,"SAN MIGUEL",null,"Y",3]
[93452,"RAGGED POINT",null,"Y",1]
[93452,"SAN SIMEON",null,"Y",2]
[93453,"CALIFORNIA VALLEY",null,"Y",1]
[93453,"POZO",null,"Y",2]
[93453,"SANTA MARGARITA",null,"Y",3]
[93453,"SN MARGARITA",null,"Y",4]
[93454,"GAREY",null,"Y",1]
[93454,"SANTA MARIA",null,"Y",2]
[93454,"SISQUOC",null,"Y",3]
[93455,"ORCUTT",null,"Y",1]
[93455,"SANTA MARIA",null,"Y",2]
[93456,"SANTA MARIA",null,"N",1]
[93457,"ORCUTT",null,"Y",1]
[93457,"SANTA MARIA",null,"Y",2]
[93458,"SANTA MARIA",null,"N",1]
[93460,"SANTA YNEZ",null,"N",1]
[93461,"CHOLAME",null,"Y",1]
[93461,"SHANDON",null,"Y",2]
[93463,"BALLARD",null,"Y",1]
[93463,"SOLVANG",null,"Y",2]
[93464,"SOLVANG",null,"N",1]
[93465,"TEMPLETON",null,"N",1]
[93483,"GROVER BEACH",null,"N",1]
[93501,"FREMONT VALLEY",null,"Y",1]
[93501,"MOJAVE",null,"Y",2]
[93502,"MOJAVE",null,"N",1]
[93504,"CALIFORNIA CITY",null,"N",1]
[93505,"CALIF CITY",null,"Y",1]
[93505,"CALIFORNIA CITY",null,"Y",2]
[93510,"ACTON",null,"N",1]
[93512,"BENTON",null,"Y",1]
[93512,"BISHOP",null,"Y",2]
[93512,"BISHOP",null,"Y",3]
[93513,"BIG PINE",null,"N",1]
[93514,"BISHOP",null,"Y",1]
[93514,"BISHOP",null,"Y",2]
[93514,"CHALFANT VALLEY",null,"Y",3]
[93514,"HAMMIL VALLEY",null,"Y",4]
[93514,"LAWS",null,"Y",5]
[93514,"ROUND VALLEY",null,"Y",6]
[93514,"ROVANA",null,"Y",7]
[93514,"SWALL MEADOWS",null,"Y",8]
[93515,"BISHOP",null,"Y",1]
[93515,"BISHOP",null,"Y",2]
[93516,"BORON",null,"Y",1]
[93516,"DESERT LAKE",null,"Y",2]
[93516,"FOUR CORNERS",null,"Y",3]
[93516,"KRAMER JUNCTION",null,"Y",4]
[93517,"BRIDGEPORT",null,"N",1]
[93518,"CALIENTE",null,"Y",1]
[93518,"HAVILAH",null,"Y",2]
[93518,"LORAINE",null,"Y",3]
[93519,"CANTIL",null,"Y",1]
[93519,"MOJAVE",null,"Y",2]
[93522,"DARWIN",null,"N",1]
[93523,"AERIAL ACRES",null,"Y",1]
[93523,"EDWARD",null,"Y",2]
[93523,"EDWARDS",null,"Y",3]
[93523,"EDWARDS AIR FORCE BASE",null,"Y",4]
[93523,"NORTH EDWARDS",null,"Y",5]
[93524,"EDWARD",null,"Y",1]
[93524,"EDWARDS",null,"Y",2]
[93524,"EDWARDS AIR FORCE BASE",null,"Y",3]
[93526,"ABERDEEN",null,"Y",1]
[93526,"INDEPENDENCE",null,"Y",2]
[93527,"INYOKERN",null,"Y",1]
[93527,"PEARSONVILLE",null,"Y",2]
[93528,"JOHANNESBURG",null,"N",1]
[93529,"JUNE LAKE",null,"Y",1]
[93529,"JUNE LAKE JUNCTION",null,"Y",2]
[93530,"KEELER",null,"N",1]
[93531,"KEENE",null,"N",1]
[93532,"ELIZABETH LAKE",null,"Y",1]
[93532,"LAKE ELIZABETH",null,"Y",2]
[93532,"LAKE HUGHES",null,"Y",3]
[93532,"LEONA VALLEY",null,"Y",4]
[93532,"SANDBERG",null,"Y",5]
[93532,"THREE POINTS",null,"Y",6]
[93534,"DEL SUR",null,"Y",1]
[93534,"FAIRMONT",null,"Y",2]
[93534,"HI VISTA",null,"Y",3]
[93534,"LANCASTER",null,"Y",4]
[93534,"LANE",null,"Y",5]
[93534,"WILSONA GARDENS",null,"Y",6]
[93535,"HI VISTA",null,"Y",1]
[93535,"LAKE LOS ANGELES",null,"Y",2]
[93535,"LANCASTER",null,"Y",3]
[93535,"ROOSEVELT CORNER",null,"Y",4]
[93535,"WILSONA GARDENS",null,"Y",5]
[93536,"DEL SUR",null,"Y",1]
[93536,"FAIRMONT",null,"Y",2]
[93536,"LANCASTER",null,"Y",3]
[93536,"METLER VALLEY",null,"Y",4]
[93536,"NEENACH",null,"Y",5]
[93536,"QUARTZ HILL",null,"Y",6]
[93539,"LANCASTER",null,"N",1]
[93541,"LEE VINING",null,"Y",1]
[93541,"MONO CITY",null,"Y",2]
[93541,"MONO LAKE",null,"Y",3]
[93542,"LITTLE LAKE",null,"N",1]
[93543,"JUNIPER HILLS",null,"Y",1]
[93543,"LITTLEROCK",null,"Y",2]
[93543,"SUN VILLAGE",null,"Y",3]
[93544,"CRYSTALAIRE",null,"Y",1]
[93544,"LLANO",null,"Y",2]
[93545,"ALABAMA HILLS",null,"Y",1]
[93545,"DOLOMITE",null,"Y",2]
[93545,"LONE PINE",null,"Y",3]
[93545,"PANAMINT SPRINGS",null,"Y",4]
[93545,"SWANSEA",null,"Y",5]
[93546,"CROWLEY LAKE",null,"Y",1]
[93546,"LAKE MARY",null,"Y",2]
[93546,"MAMMOTH LAKES",null,"Y",3]
[93549,"CARTAGO",null,"Y",1]
[93549,"OLANCHA",null,"Y",2]
[93550,"LAKE LOS ANGELES",null,"Y",1]
[93550,"PALMDALE",null,"Y",2]
[93551,"LEONA VALLEY",null,"Y",1]
[93551,"PALMDALE",null,"Y",2]
[93551,"QUARTZ HILL",null,"Y",3]
[93551,"RITTER RANCH",null,"Y",4]
[93552,"PALMDALE",null,"N",1]
[93553,"JUNIPER HILLS",null,"Y",1]
[93553,"PEARBLOSSOM",null,"Y",2]
[93554,"GARLOCK",null,"Y",1]
[93554,"JOHANNESBURG",null,"Y",2]
[93554,"RANDSBURG",null,"Y",3]
[93555,"RIDGECREST",null,"N",1]
[93556,"RIDGECREST",null,"N",1]
[93558,"JOHANNESBURG",null,"Y",1]
[93558,"RED MOUNTAIN",null,"Y",2]
[93560,"ROSAMOND",null,"Y",1]
[93560,"TROPICO VILLAGE",null,"Y",2]
[93560,"WILLOW SPRINGS",null,"Y",3]
[93561,"ALPINE FOREST",null,"Y",1]
[93561,"BEAR VALLEY SPRINGS",null,"Y",2]
[93561,"CALIFORNIA CORRECTIONAL INST",null,"Y",3]
[93561,"GOLDEN HILLS",null,"Y",4]
[93561,"MONOLITH",null,"Y",5]
[93561,"SAND CANYON",null,"Y",6]
[93561,"STALLION SPRINGS",null,"Y",7]
[93561,"TEHACHAPI",null,"Y",8]
[93562,"ARGUS",null,"Y",1]
[93562,"BALLARAT",null,"Y",2]
[93562,"PIONEER POINT",null,"Y",3]
[93562,"TRONA",null,"Y",4]
[93563,"PEARBLOSSOM",null,"Y",1]
[93563,"VALYERMO",null,"Y",2]
[93581,"TEHACHAPI",null,"N",1]
[93582,"TEHACHAPI",null,"N",1]
[93584,"LANCASTER",null,"N",1]
[93586,"LANCASTER",null,"Y",1]
[93586,"QUARTZ HILL",null,"Y",2]
[93590,"PALMDALE",null,"N",1]
[93591,"LAKE LOS ANGELES",null,"Y",1]
[93591,"PALMDALE",null,"Y",2]
[93592,"TRONA",null,"N",1]
[93596,"BORON",null,"N",1]
[93599,"PALMDALE",null,"N",1]
[93601,"AHWAHNEE",null,"Y",1]
[93601,"NIPINNAWASSEE",null,"Y",2]
[93602,"AUBERRY",null,"Y",1]
[93602,"PINERIDGE",null,"Y",2]
[93603,"BADGER",null,"Y",1]
[93603,"MIRAMONTE",null,"Y",2]
[93604,"BASS LAKE",null,"Y",1]
[93604,"BASS LAKE",null,"Y",2]
[93605,"BIG CREEK",null,"Y",1]
[93605,"BIG CREEK",null,"Y",2]
[93606,"BIOLA",null,"N",1]
[93607,"BURREL",null,"Y",1]
[93607,"RIVERDALE",null,"Y",2]
[93608,"CANTUA CREEK",null,"Y",1]
[93608,"THREE ROCKS",null,"Y",2]
[93609,"CARUTHERS",null,"N",1]
[93610,"CHOWCHILLA",null,"Y",1]
[93610,"FAIRMEAD",null,"Y",2]
[93610,"SHARON",null,"Y",3]
[93611,"CLOVIS",null,"Y",1]
[93611,"CLOVIS",null,"Y",2]
[93612,"CLOVIS",null,"Y",1]
[93612,"CLOVIS",null,"Y",2]
[93613,"CLOVIS",null,"Y",1]
[93613,"CLOVIS",null,"Y",2]
[93614,"COARSEGOLD",null,"N",1]
[93615,"CUTLER",null,"N",1]
[93616,"DEL REY",null,"N",1]
[93618,"DINUBA",null,"Y",1]
[93618,"LONDON",null,"Y",2]
[93620,"DOS PALOS",null,"N",1]
[93621,"DUNLAP",null,"N",1]
[93622,"FIREBAUGH",null,"N",1]
[93623,"FISH CAMP",null,"N",1]
[93624,"FIVE POINTS",null,"N",1]
[93625,"FOWLER",null,"N",1]
[93626,"FRIANT",null,"N",1]
[93627,"HELM",null,"N",1]
[93628,"HUME",null,"Y",1]
[93628,"MIRAMONTE",null,"Y",2]
[93629,"BIG CREEK",null,"Y",1]
[93629,"BIG CREEK",null,"Y",2]
[93629,"HUNTINGTON LAKE",null,"Y",3]
[93630,"KERMAN",null,"N",1]
[93631,"KINGSBURG",null,"N",1]
[93633,"GRANT GROVE",null,"Y",1]
[93633,"KINGS CANYON NATIONAL PK",null,"Y",2]
[93633,"MIRAMONTE",null,"Y",3]
[93633,"WILSONIA",null,"Y",4]
[93634,"LAKESHORE",null,"Y",1]
[93634,"SHAVER LAKE",null,"Y",2]
[93635,"LOS BANOS",null,"N",1]
[93637,"MADERA",null,"N",1]
[93638,"MADERA",null,"N",1]
[93639,"MADERA",null,"N",1]
[93640,"MENDOTA",null,"N",1]
[93641,"MIRAMONTE",null,"Y",1]
[93641,"PINEHURST",null,"Y",2]
[93642,"MONO HOT SPRINGS",null,"Y",1]
[93642,"SHAVER LAKE",null,"Y",2]
[93643,"NORTH FORK",null,"N",1]
[93644,"OAKHURST",null,"N",1]
[93645,"O NEALS",null,"N",1]
[93646,"ORANGE COVE",null,"Y",1]
[93646,"SQUAW VALLEY",null,"Y",2]
[93647,"EAST OROSI",null,"Y",1]
[93647,"OROSI",null,"Y",2]
[93648,"PARLIER",null,"N",1]
[93649,"PIEDRA",null,"N",1]
[93650,"FRESNO",null,"Y",1]
[93650,"PINEDALE",null,"Y",2]
[93651,"PRATHER",null,"N",1]
[93652,"RAISIN",null,"Y",1]
[93652,"RAISIN CITY",null,"Y",2]
[93653,"RAYMOND",null,"N",1]
[93654,"NAVELENCIA",null,"Y",1]
[93654,"REEDLEY",null,"Y",2]
[93656,"RIVERDALE",null,"N",1]
[93657,"CENTERVILLE",null,"Y",1]
[93657,"MINKLER",null,"Y",2]
[93657,"SANGER",null,"Y",3]
[93657,"TIVY VALLEY",null,"Y",4]
[93660,"SAN JOAQUIN",null,"N",1]
[93661,"SANTA RITA PARK",null,"N",1]
[93662,"CONEJO",null,"Y",1]
[93662,"SELMA",null,"Y",2]
[93664,"DINKEY CREEK",null,"Y",1]
[93664,"SHAVER LAKE",null,"Y",2]
[93665,"SOUTH DOS PALOS",null,"N",1]
[93666,"SULTANA",null,"N",1]
[93667,"TOLLHOUSE",null,"N",1]
[93668,"TRANQUILLITY",null,"N",1]
[93669,"BASS LAKE",null,"Y",1]
[93669,"BASS LAKE",null,"Y",2]
[93669,"WISHON",null,"Y",3]
[93670,"YETTEM",null,"N",1]
[93673,"TRAVER",null,"N",1]
[93675,"ORANGE COVE",null,"Y",1]
[93675,"SQUAW VALLEY",null,"Y",2]
[93701,"FRESNO",null,"N",1]
[93702,"FRESNO",null,"N",1]
[93703,"FRESNO",null,"N",1]
[93704,"FRESNO",null,"N",1]
[93705,"FRESNO",null,"N",1]
[93706,"EASTON",null,"Y",1]
[93706,"FRESNO",null,"Y",2]
[93706,"ROLINDA",null,"Y",3]
[93707,"FRESNO",null,"N",1]
[93708,"FRESNO",null,"N",1]
[93709,"FRESNO",null,"N",1]
[93710,"FRESNO",null,"N",1]
[93711,"FRESNO",null,"N",1]
[93712,"FRESNO",null,"N",1]
[93714,"FRESNO",null,"N",1]
[93715,"FRESNO",null,"N",1]
[93716,"FRESNO",null,"N",1]
[93717,"FRESNO",null,"N",1]
[93718,"FRESNO",null,"N",1]
[93720,"FRESNO",null,"N",1]
[93721,"FRESNO",null,"N",1]
[93722,"FRESNO",null,"N",1]
[93724,"FRESNO",null,"N",1]
[93725,"CALWA",null,"Y",1]
[93725,"FRESNO",null,"Y",2]
[93725,"MALAGA",null,"Y",3]
[93726,"FRESNO",null,"N",1]
[93727,"FRESNO",null,"N",1]
[93728,"FRESNO",null,"N",1]
[93729,"FRESNO",null,"N",1]
[93740,"FRESNO",null,"Y",1]
[93740,"FRESNO STATE UNIVERSITY",null,"Y",2]
[93741,"FRESNO",null,"N",1]
[93744,"FRESNO",null,"N",1]
[93745,"CALWA",null,"Y",1]
[93745,"FRESNO",null,"Y",2]
[93747,"FRESNO",null,"N",1]
[93750,"FRESNO",null,"N",1]
[93755,"FRESNO",null,"N",1]
[93759,"FRESNO",null,"N",1]
[93760,"FRESNO",null,"N",1]
[93761,"FRESNO",null,"N",1]
[93762,"FRESNO",null,"N",1]
[93764,"FRESNO",null,"N",1]
[93765,"FRESNO",null,"N",1]
[93771,"FRESNO",null,"N",1]
[93772,"FRESNO",null,"N",1]
[93773,"FRESNO",null,"N",1]
[93774,"FRESNO",null,"N",1]
[93775,"FRESNO",null,"N",1]
[93776,"FRESNO",null,"N",1]
[93777,"FRESNO",null,"N",1]
[93778,"FRESNO",null,"N",1]
[93779,"FRESNO",null,"N",1]
[93780,"FRESNO",null,"N",1]
[93782,"FRESNO",null,"N",1]
[93784,"FRESNO",null,"N",1]
[93786,"FRESNO",null,"N",1]
[93790,"FRESNO",null,"N",1]
[93791,"FRESNO",null,"N",1]
[93792,"FRESNO",null,"N",1]
[93793,"FRESNO",null,"N",1]
[93794,"FRESNO",null,"N",1]
[93844,"FRESNO",null,"N",1]
[93888,"FRESNO",null,"N",1]
[93901,"SALINAS",null,"N",1]
[93902,"SALINAS",null,"N",1]
[93905,"ALISAL",null,"Y",1]
[93905,"SALINAS",null,"Y",2]
[93906,"SALINAS",null,"N",1]
[93907,"PRUNEDALE",null,"Y",1]
[93907,"SALINAS",null,"Y",2]
[93908,"SALINAS",null,"N",1]
[93912,"SALINAS",null,"N",1]
[93915,"SALINAS",null,"N",1]
[93920,"BIG SUR",null,"Y",1]
[93920,"GORDA",null,"Y",2]
[93920,"LUCIA",null,"Y",3]
[93920,"PACIFIC VALLEY",null,"Y",4]
[93921,"CARMEL",null,"Y",1]
[93921,"CARMEL BY THE SEA",null,"Y",2]
[93922,"CARMEL",null,"N",1]
[93923,"CARMEL",null,"Y",1]
[93923,"CARMEL HIGHLANDS",null,"Y",2]
[93924,"CARMEL VALLEY",null,"Y",1]
[93924,"CARMEL VALLEY VILLAGE",null,"Y",2]
[93924,"ROBLES DEL RIO",null,"Y",3]
[93924,"TASSAJARA HOT SPRINGS",null,"Y",4]
[93925,"CHUALAR",null,"N",1]
[93926,"GONZALES",null,"N",1]
[93927,"GREENFIELD",null,"N",1]
[93928,"FORT HUNTER LIGGETT",null,"Y",1]
[93928,"JOLON",null,"Y",2]
[93930,"KING CITY",null,"N",1]
[93932,"LOCKWOOD",null,"N",1]
[93933,"MARINA",null,"N",1]
[93940,"DEL REY OAKS",null,"Y",1]
[93940,"MONTEREY",null,"Y",2]
[93940,"NEW MONTEREY",null,"Y",3]
[93940,"POINT SUR",null,"Y",4]
[93940,"PRESIDIO OF MONTEREY",null,"Y",5]
[93942,"MONTEREY",null,"N",1]
[93943,"MONTEREY",null,"N",1]
[93944,"MONTEREY",null,"Y",1]
[93944,"PRESIDIO OF MONTEREY",null,"Y",2]
[93950,"DEL MONTE PARK",null,"Y",1]
[93950,"PACIFIC GROVE",null,"Y",2]
[93953,"PEBBLE BEACH",null,"N",1]
[93954,"SAN LUCAS",null,"N",1]
[93955,"SAND CITY",null,"Y",1]
[93955,"SEASIDE",null,"Y",2]
[93960,"SOLEDAD",null,"N",1]
[93962,"SALINAS",null,"Y",1]
[93962,"SPRECKELS",null,"Y",2]
[94002,"BELMONT",null,"Y",1]
[94002,"BELMONT",null,"Y",2]
[94003,"BELMONT",null,"Y",1]
[94003,"BELMONT",null,"Y",2]
[94005,"BRISBANE",null,"N",1]
[94010,"BURLINGAME",null,"Y",1]
[94010,"HILLSBOROUGH",null,"Y",2]
[94011,"BURLINGAME",null,"N",1]
[94012,"BURLINGAME",null,"N",1]
[94014,"COLMA",null,"Y",1]
[94014,"DALY CITY",null,"Y",2]
[94015,"DALY CITY",null,"N",1]
[94016,"DALY CITY",null,"N",1]
[94017,"DALY CITY",null,"N",1]
[94018,"EL GRANADA",null,"N",1]
[94019,"HALF MOON BAY",null,"Y",1]
[94019,"PRINCETON BY THE SEA",null,"Y",2]
[94020,"LA HONDA",null,"N",1]
[94021,"LOMA MAR",null,"N",1]
[94022,"LOS ALTOS",null,"Y",1]
[94022,"LOS ALTOS HILLS",null,"Y",2]
[94023,"LOS ALTOS",null,"N",1]
[94024,"LOS ALTOS",null,"Y",1]
[94024,"LOS ALTOS HILLS",null,"Y",2]
[94025,"MENLO PARK",null,"Y",1]
[94025,"WEST MENLO PARK",null,"Y",2]
[94026,"MENLO PARK",null,"N",1]
[94027,"ATHERTON",null,"Y",1]
[94027,"ATHERTON CONTRACT BRANCH",null,"Y",2]
[94027,"MENLO PARK",null,"Y",3]
[94028,"LADERA",null,"Y",1]
[94028,"MENLO PARK",null,"Y",2]
[94028,"MENLO PK",null,"Y",3]
[94028,"PORTOLA VALLEY",null,"Y",4]
[94029,"MENLO PARK",null,"N",1]
[94030,"MILLBRAE",null,"N",1]
[94031,"MILLBRAE",null,"N",1]
[94035,"MOFFETT FIELD",null,"Y",1]
[94035,"MOFFETT FIELD NAS",null,"Y",2]
[94035,"MOUNTAIN VIEW",null,"Y",3]
[94037,"MONTARA",null,"N",1]
[94038,"MOSS BEACH",null,"N",1]
[94039,"CASTRO CENTER",null,"Y",1]
[94039,"MOUNTAIN VIEW",null,"Y",2]
[94040,"BLOSSOM VALLEY",null,"Y",1]
[94040,"MOUNTAIN VIEW",null,"Y",2]
[94040,"MT VIEW",null,"Y",3]
[94041,"MOUNTAIN VIEW",null,"N",1]
[94042,"MOUNTAIN VIEW",null,"N",1]
[94043,"MOUNTAIN VIEW",null,"N",1]
[94044,"PACIFICA",null,"Y",1]
[94044,"SHARP PARK",null,"Y",2]
[94045,"PACIFICA",null,"N",1]
[94059,"REDWOOD CITY",null,"N",1]
[94060,"PESCADERO",null,"N",1]
[94061,"REDWOOD CITY",null,"N",1]
[94062,"EMERALD HILLS",null,"Y",1]
[94062,"REDWOOD CITY",null,"Y",2]
[94062,"WOODSIDE",null,"Y",3]
[94063,"REDWOOD CITY",null,"N",1]
[94064,"REDWOOD CITY",null,"N",1]
[94065,"REDWOOD CITY",null,"N",1]
[94066,"SAN BRUNO",null,"N",1]
[94067,"SAN BRUNO",null,"N",1]
[94070,"SAN CARLOS",null,"N",1]
[94071,"SAN CARLOS",null,"N",1]
[94074,"SAN GREGORIO",null,"N",1]
[94080,"SOUTH SAN FRANCISCO",null,"Y",1]
[94080,"SOUTH SF",null,"Y",2]
[94080,"SSF",null,"Y",3]
[94083,"SOUTH SAN FRANCISCO",null,"N",1]
[94086,"SUNNYVALE",null,"N",1]
[94087,"SUNNYVALE",null,"N",1]
[94088,"ONIZUKA AFB",null,"Y",1]
[94088,"SUNNYVALE",null,"Y",2]
[94089,"SUNNYVALE",null,"N",1]
[94090,"SUNNYVALE",null,"N",1]
[94096,"SAN BRUNO",null,"N",1]
[94098,"SAN BRUNO",null,"N",1]
[94099,"SOUTH SAN FRANCISCO",null,"N",1]
[94101,"SAN FRANCISCO",null,"N",1]
[94102,"SAN FRANCISCO",null,"N",1]
[94103,"SAN FRANCISCO",null,"N",1]
[94104,"SAN FRANCISCO",null,"N",1]
[94105,"SAN FRANCISCO",null,"N",1]
[94106,"SAN FRANCISCO",null,"N",1]
[94107,"SAN FRANCISCO",null,"N",1]
[94108,"SAN FRANCISCO",null,"N",1]
[94109,"SAN FRANCISCO",null,"N",1]
[94110,"SAN FRANCISCO",null,"N",1]
[94111,"SAN FRANCISCO",null,"N",1]
[94112,"SAN FRANCISCO",null,"N",1]
[94114,"SAN FRANCISCO",null,"N",1]
[94115,"SAN FRANCISCO",null,"N",1]
[94116,"SAN FRANCISCO",null,"N",1]
[94117,"SAN FRANCISCO",null,"N",1]
[94118,"SAN FRANCISCO",null,"N",1]
[94119,"SAN FRANCISCO",null,"N",1]
[94120,"SAN FRANCISCO",null,"N",1]
[94121,"SAN FRANCISCO",null,"N",1]
[94122,"SAN FRANCISCO",null,"N",1]
[94123,"SAN FRANCISCO",null,"N",1]
[94124,"SAN FRANCISCO",null,"N",1]
[94125,"SAN FRANCISCO",null,"N",1]
[94126,"SAN FRANCISCO",null,"N",1]
[94127,"SAN FRANCISCO",null,"N",1]
[94128,"AIRPORT",null,"Y",1]
[94128,"AIRPORT MAIL CENTER",null,"Y",2]
[94128,"SAN FRANCISCO",null,"Y",3]
[94128,"SAN FRANCISCO INTNL AIRPORT",null,"Y",4]
[94129,"LETTERMAN ARMY MEDICAL CTR",null,"Y",1]
[94129,"PRESIDIO",null,"Y",2]
[94129,"PRESIDIO OF SAN FRANCISCO",null,"Y",3]
[94129,"SAN FRANCISCO",null,"Y",4]
[94130,"SAN FRANCISCO",null,"N",1]
[94131,"SAN FRANCISCO",null,"N",1]
[94132,"SAN FRANCISCO",null,"N",1]
[94133,"SAN FRANCISCO",null,"N",1]
[94134,"SAN FRANCISCO",null,"N",1]
[94135,"SAN FRANCISCO",null,"N",1]
[94136,"SAN FRANCISCO",null,"N",1]
[94137,"SAN FRANCISCO",null,"N",1]
[94138,"SAN FRANCISCO",null,"N",1]
[94139,"SAN FRANCISCO",null,"N",1]
[94140,"SAN FRANCISCO",null,"N",1]
[94141,"SAN FRANCISCO",null,"N",1]
[94142,"SAN FRANCISCO",null,"N",1]
[94143,"SAN FRANCISCO",null,"N",1]
[94144,"SAN FRANCISCO",null,"N",1]
[94145,"SAN FRANCISCO",null,"N",1]
[94146,"SAN FRANCISCO",null,"N",1]
[94147,"SAN FRANCISCO",null,"N",1]
[94150,"SAN FRANCISCO",null,"N",1]
[94151,"IRS REMITTANCE",null,"Y",1]
[94151,"SAN FRANCISCO",null,"Y",2]
[94152,"SAN FRANCISCO",null,"N",1]
[94153,"SAN FRANCISCO",null,"N",1]
[94154,"SAN FRANCISCO",null,"N",1]
[94155,"SAN FRANCISCO",null,"N",1]
[94156,"SAN FRANCISCO",null,"N",1]
[94157,"SAN FRANCISCO",null,"N",1]
[94159,"SAN FRANCISCO",null,"N",1]
[94160,"SAN FRANCISCO",null,"N",1]
[94161,"BANK OF AMERICA",null,"Y",1]
[94161,"SAN FRANCISCO",null,"Y",2]
[94162,"SAN FRANCISCO",null,"N",1]
[94163,"SAN FRANCISCO",null,"N",1]
[94164,"SAN FRANCISCO",null,"N",1]
[94165,"SAN FRANCISCO",null,"N",1]
[94166,"SAN FRANCISCO",null,"N",1]
[94167,"SAN FRANCISCO",null,"N",1]
[94168,"SAN FRANCISCO",null,"N",1]
[94169,"SAN FRANCISCO",null,"N",1]
[94170,"SAN FRANCISCO",null,"N",1]
[94171,"SAN FRANCISCO",null,"N",1]
[94172,"SAN FRANCISCO",null,"N",1]
[94175,"SAN FRANCISCO",null,"N",1]
[94177,"SAN FRANCISCO",null,"N",1]
[94188,"SAN FRANCISCO",null,"N",1]
[94203,"SACRAMENTO",null,"N",1]
[94204,"SACRAMENTO",null,"N",1]
[94205,"SACRAMENTO",null,"N",1]
[94206,"SACRAMENTO",null,"N",1]
[94207,"SACRAMENTO",null,"N",1]
[94208,"SACRAMENTO",null,"N",1]
[94209,"SACRAMENTO",null,"N",1]
[94211,"SACRAMENTO",null,"N",1]
[94229,"SACRAMENTO",null,"N",1]
[94230,"SACRAMENTO",null,"N",1]
[94232,"SACRAMENTO",null,"N",1]
[94234,"SACRAMENTO",null,"N",1]
[94235,"SACRAMENTO",null,"N",1]
[94236,"SACRAMENTO",null,"N",1]
[94237,"SACRAMENTO",null,"N",1]
[94239,"SACRAMENTO",null,"N",1]
[94240,"SACRAMENTO",null,"N",1]
[94243,"SACRAMENTO",null,"N",1]
[94244,"SACRAMENTO",null,"N",1]
[94245,"SACRAMENTO",null,"N",1]
[94246,"SACRAMENTO",null,"N",1]
[94247,"SACRAMENTO",null,"N",1]
[94248,"SACRAMENTO",null,"N",1]
[94249,"SACRAMENTO",null,"N",1]
[94250,"SACRAMENTO",null,"N",1]
[94252,"SACRAMENTO",null,"N",1]
[94253,"SACRAMENTO",null,"N",1]
[94254,"SACRAMENTO",null,"N",1]
[94256,"SACRAMENTO",null,"N",1]
[94257,"SACRAMENTO",null,"N",1]
[94258,"SACRAMENTO",null,"N",1]
[94259,"SACRAMENTO",null,"N",1]
[94261,"SACRAMENTO",null,"N",1]
[94262,"SACRAMENTO",null,"N",1]
[94263,"SACRAMENTO",null,"N",1]
[94267,"SACRAMENTO",null,"N",1]
[94268,"SACRAMENTO",null,"N",1]
[94269,"SACRAMENTO",null,"N",1]
[94271,"SACRAMENTO",null,"N",1]
[94273,"SACRAMENTO",null,"N",1]
[94274,"SACRAMENTO",null,"N",1]
[94277,"SACRAMENTO",null,"N",1]
[94278,"SACRAMENTO",null,"N",1]
[94279,"SACRAMENTO",null,"N",1]
[94280,"SACRAMENTO",null,"N",1]
[94282,"SACRAMENTO",null,"N",1]
[94283,"SACRAMENTO",null,"N",1]
[94284,"SACRAMENTO",null,"N",1]
[94285,"SACRAMENTO",null,"N",1]
[94286,"SACRAMENTO",null,"N",1]
[94287,"SACRAMENTO",null,"N",1]
[94288,"SACRAMENTO",null,"N",1]
[94289,"SACRAMENTO",null,"N",1]
[94290,"SACRAMENTO",null,"N",1]
[94291,"SACRAMENTO",null,"N",1]
[94293,"SACRAMENTO",null,"N",1]
[94294,"SACRAMENTO",null,"N",1]
[94295,"SACRAMENTO",null,"N",1]
[94296,"SACRAMENTO",null,"N",1]
[94297,"SACRAMENTO",null,"N",1]
[94298,"SACRAMENTO",null,"N",1]
[94299,"SACRAMENTO",null,"N",1]
[94301,"PALO ALTO",null,"N",1]
[94302,"PALO ALTO",null,"N",1]
[94303,"E PALO ALTO",null,"Y",1]
[94303,"EAST PALO ALTO",null,"Y",2]
[94303,"PALO ALTO",null,"Y",3]
[94304,"PALO ALTO",null,"N",1]
[94305,"PALO ALTO",null,"Y",1]
[94305,"STANFORD",null,"Y",2]
[94306,"PALO ALTO",null,"N",1]
[94307,"PALO ALTO",null,"N",1]
[94308,"PALO ALTO",null,"N",1]
[94309,"PALO ALTO",null,"Y",1]
[94309,"STANFORD",null,"Y",2]
[94310,"PALO ALTO",null,"N",1]
[94401,"SAN MATEO",null,"N",1]
[94402,"SAN MATEO",null,"N",1]
[94403,"SAN MATEO",null,"N",1]
[94404,"FOSTER CITY",null,"Y",1]
[94404,"SAN MATEO",null,"Y",2]
[94405,"SAN MATEO",null,"N",1]
[94406,"SAN MATEO",null,"N",1]
[94407,"SAN MATEO",null,"N",1]
[94408,"SAN MATEO",null,"N",1]
[94409,"SAN MATEO",null,"N",1]
[94497,"SAN MATEO",null,"N",1]
[94501,"ALAMEDA",null,"Y",1]
[94501,"NAS ALAMEDA",null,"Y",2]
[94502,"ALAMEDA",null,"N",1]
[94506,"BLACKHAWK",null,"Y",1]
[94506,"DANVILLE",null,"Y",2]
[94507,"ALAMO",null,"N",1]
[94508,"ANGWIN",null,"N",1]
[94509,"ANTIOCH",null,"N",1]
[94510,"BENICIA",null,"N",1]
[94511,"BETHEL ISLAND",null,"N",1]
[94512,"BIRDS LANDING",null,"N",1]
[94513,"BRENTWOOD",null,"N",1]
[94514,"BYRON",null,"Y",1]
[94514,"DISCOVERY BAY",null,"Y",2]
[94515,"CALISTOGA",null,"N",1]
[94516,"CANYON",null,"N",1]
[94517,"CLAYTON",null,"N",1]
[94518,"CONCORD",null,"N",1]
[94519,"CONCORD",null,"N",1]
[94520,"CLYDE",null,"Y",1]
[94520,"CONCORD",null,"Y",2]
[94521,"CONCORD",null,"N",1]
[94522,"CONCORD",null,"N",1]
[94523,"CONCORD",null,"Y",1]
[94523,"PLEASANT HILL",null,"Y",2]
[94524,"CONCORD",null,"N",1]
[94525,"CROCKETT",null,"N",1]
[94526,"DANVILLE",null,"N",1]
[94527,"CONCORD",null,"N",1]
[94528,"DIABLO",null,"N",1]
[94529,"CONCORD",null,"N",1]
[94530,"EL CERRITO",null,"N",1]
[94531,"ANTIOCH",null,"N",1]
[94533,"FAIRFIELD",null,"N",1]
[94535,"FAIRFIELD",null,"Y",1]
[94535,"TRAVIS AFB",null,"Y",2]
[94536,"FREMONT",null,"N",1]
[94537,"FREMONT",null,"N",1]
[94538,"FREMONT",null,"N",1]
[94539,"FREMONT",null,"N",1]
[94540,"HAYWARD",null,"N",1]
[94541,"HAYWARD",null,"N",1]
[94542,"HAYWARD",null,"N",1]
[94543,"HAYWARD",null,"N",1]
[94544,"HAYWARD",null,"N",1]
[94545,"HAYWARD",null,"N",1]
[94546,"CASTRO VALLEY",null,"Y",1]
[94546,"HAYWARD",null,"Y",2]
[94547,"HERCULES",null,"Y",1]
[94547,"RODEO",null,"Y",2]
[94548,"KNIGHTSEN",null,"N",1]
[94549,"LAFAYETTE",null,"N",1]
[94550,"LIVERMORE",null,"N",1]
[94551,"LIVERMORE",null,"N",1]
[94552,"CASTRO VALLEY",null,"Y",1]
[94552,"HAYWARD",null,"Y",2]
[94553,"MARTINEZ",null,"Y",1]
[94553,"PACHECO",null,"Y",2]
[94555,"FREMONT",null,"N",1]
[94556,"MORAGA",null,"N",1]
[94557,"HAYWARD",null,"Y",1]
[94557,"MOUNT EDEN",null,"Y",2]
[94558,"NAPA",null,"Y",1]
[94558,"SPANISH FLAT",null,"Y",2]
[94559,"NAPA",null,"N",1]
[94560,"NEWARK",null,"N",1]
[94561,"OAKLEY",null,"N",1]
[94562,"OAKVILLE",null,"N",1]
[94563,"ORINDA",null,"N",1]
[94564,"PINOLE",null,"N",1]
[94565,"BAY POINT",null,"Y",1]
[94565,"PITTSBURG",null,"Y",2]
[94565,"PORT CHICAGO",null,"Y",3]
[94565,"WEST PITTSBURG",null,"Y",4]
[94566,"PLEASANTON",null,"N",1]
[94567,"POPE VALLEY",null,"N",1]
[94568,"DUBLIN",null,"Y",1]
[94568,"PLEASANTON",null,"Y",2]
[94569,"PORT COSTA",null,"N",1]
[94570,"MORAGA",null,"N",1]
[94571,"RIO VISTA",null,"N",1]
[94572,"RODEO",null,"N",1]
[94573,"RUTHERFORD",null,"N",1]
[94574,"SAINT HELENA",null,"N",1]
[94575,"MORAGA",null,"N",1]
[94576,"ANGWIN",null,"Y",1]
[94576,"DEER PARK",null,"Y",2]
[94577,"SAN LEANDRO",null,"N",1]
[94578,"SAN LEANDRO",null,"N",1]
[94579,"SAN LEANDRO",null,"N",1]
[94580,"SAN LORENZO",null,"N",1]
[94581,"NAPA",null,"N",1]
[94582,"PLEASANTON",null,"N",1]
[94583,"SAN RAMON",null,"N",1]
[94585,"FAIRFIELD",null,"Y",1]
[94585,"SUISUN CITY",null,"Y",2]
[94586,"SUNOL",null,"N",1]
[94587,"UNION CITY",null,"N",1]
[94588,"PLEASANTON",null,"N",1]
[94589,"AMERICAN CANYON",null,"Y",1]
[94589,"VALLEJO",null,"Y",2]
[94590,"VALLEJO",null,"N",1]
[94591,"VALLEJO",null,"N",1]
[94592,"VALLEJO",null,"N",1]
[94595,"LAFAYETTE",null,"Y",1]
[94595,"WALNUT CREEK",null,"Y",2]
[94596,"LAFAYETTE",null,"Y",1]
[94596,"WALNUT CREEK",null,"Y",2]
[94597,"WALNUT CREEK",null,"N",1]
[94598,"WALNUT CREEK",null,"N",1]
[94599,"YOUNTVILLE",null,"N",1]
[94601,"OAKLAND",null,"N",1]
[94602,"OAKLAND",null,"Y",1]
[94602,"PIEDMONT",null,"Y",2]
[94603,"OAKLAND",null,"N",1]
[94604,"OAKLAND",null,"N",1]
[94605,"OAKLAND",null,"N",1]
[94606,"OAKLAND",null,"N",1]
[94607,"OAKLAND",null,"N",1]
[94608,"EMERYVILLE",null,"Y",1]
[94608,"OAKLAND",null,"Y",2]
[94609,"OAKLAND",null,"N",1]
[94610,"OAKLAND",null,"Y",1]
[94610,"PIEDMONT",null,"Y",2]
[94611,"OAKLAND",null,"Y",1]
[94611,"PIEDMONT",null,"Y",2]
[94612,"OAKLAND",null,"N",1]
[94613,"OAKLAND",null,"N",1]
[94614,"OAKLAND",null,"N",1]
[94615,"OAKLAND",null,"N",1]
[94616,"OAKLAND",null,"N",1]
[94617,"OAKLAND",null,"N",1]
[94618,"OAKLAND",null,"Y",1]
[94618,"PIEDMONT",null,"Y",2]
[94619,"OAKLAND",null,"N",1]
[94620,"OAKLAND",null,"Y",1]
[94620,"PIEDMONT",null,"Y",2]
[94621,"OAKLAND",null,"N",1]
[94623,"OAKLAND",null,"N",1]
[94624,"OAKLAND",null,"N",1]
[94625,"OAKLAND",null,"N",1]
[94626,"OAKLAND",null,"N",1]
[94627,"OAKLAND",null,"N",1]
[94643,"OAKLAND",null,"N",1]
[94649,"OAKLAND",null,"N",1]
[94650,"OAKLAND",null,"N",1]
[94659,"OAKLAND",null,"N",1]
[94660,"OAKLAND",null,"N",1]
[94661,"OAKLAND",null,"N",1]
[94662,"EMERYVILLE",null,"Y",1]
[94662,"OAKLAND",null,"Y",2]
[94666,"OAKLAND",null,"N",1]
[94701,"BERKELEY",null,"Y",1]
[94701,"BERKELEY",null,"Y",2]
[94702,"BERKELEY",null,"Y",1]
[94702,"BERKELEY",null,"Y",2]
[94703,"BERKELEY",null,"Y",1]
[94703,"BERKELEY",null,"Y",2]
[94704,"BERKELEY",null,"Y",1]
[94704,"BERKELEY",null,"Y",2]
[94705,"BERKELEY",null,"Y",1]
[94705,"BERKELEY",null,"Y",2]
[94706,"ALBANY",null,"Y",1]
[94706,"BERKELEY",null,"Y",2]
[94706,"BERKELEY",null,"Y",3]
[94706,"KENSINGTON",null,"Y",4]
[94707,"BERKELEY",null,"Y",1]
[94707,"BERKELEY",null,"Y",2]
[94707,"KENSINGTON",null,"Y",3]
[94708,"BERKELEY",null,"Y",1]
[94708,"BERKELEY",null,"Y",2]
[94708,"KENSINGTON",null,"Y",3]
[94709,"BERKELEY",null,"Y",1]
[94709,"BERKELEY",null,"Y",2]
[94710,"ALBANY",null,"Y",1]
[94710,"BERKELEY",null,"Y",2]
[94710,"BERKELEY",null,"Y",3]
[94712,"BERKELEY",null,"Y",1]
[94712,"BERKELEY",null,"Y",2]
[94720,"BERKELEY",null,"Y",1]
[94720,"BERKELEY",null,"Y",2]
[94801,"NORTH RICHMOND",null,"Y",1]
[94801,"POINT RICHMOND",null,"Y",2]
[94801,"RICHMOND",null,"Y",3]
[94802,"RICHMOND",null,"N",1]
[94803,"EL SOBRANTE",null,"Y",1]
[94803,"RICHMOND",null,"Y",2]
[94804,"RICHMOND",null,"N",1]
[94805,"RICHMOND",null,"N",1]
[94806,"HILLTOP MALL",null,"Y",1]
[94806,"RICHMOND",null,"Y",2]
[94806,"SAN PABLO",null,"Y",3]
[94807,"POINT RICHMOND",null,"Y",1]
[94807,"RICHMOND",null,"Y",2]
[94808,"RICHMOND",null,"N",1]
[94820,"EL SOBRANTE",null,"Y",1]
[94820,"RICHMOND",null,"Y",2]
[94850,"RICHMOND",null,"N",1]
[94901,"SAN RAFAEL",null,"N",1]
[94903,"MARINWOOD",null,"Y",1]
[94903,"SAN RAFAEL",null,"Y",2]
[94903,"SANTA VENETIA",null,"Y",3]
[94903,"TERRA LINDA",null,"Y",4]
[94904,"GREENBRAE",null,"Y",1]
[94904,"KENT WOODLANDS",null,"Y",2]
[94904,"KENTFIELD",null,"Y",3]
[94904,"SAN RAFAEL",null,"Y",4]
[94912,"SAN RAFAEL",null,"N",1]
[94913,"SAN RAFAEL",null,"N",1]
[94914,"GREENBRAE",null,"Y",1]
[94914,"KENTFIELD",null,"Y",2]
[94914,"SAN RAFAEL",null,"Y",3]
[94915,"MISSION RAFAEL",null,"Y",1]
[94915,"SAN RAFAEL",null,"Y",2]
[94920,"BELVEDERE",null,"Y",1]
[94920,"BELVEDERE TIBURON",null,"Y",2]
[94920,"TIBURON",null,"Y",3]
[94922,"BODEGA",null,"N",1]
[94923,"BODEGA BAY",null,"Y",1]
[94923,"SALMON CREEK",null,"Y",2]
[94924,"BOLINAS",null,"Y",1]
[94924,"DOGTOWN",null,"Y",2]
[94925,"CORTE MADERA",null,"N",1]
[94926,"COTATI",null,"Y",1]
[94926,"ROHNERT PARK",null,"Y",2]
[94927,"COTATI",null,"Y",1]
[94927,"ROHNERT PARK",null,"Y",2]
[94928,"COTATI",null,"Y",1]
[94928,"ROHNERT PARK",null,"Y",2]
[94929,"DILLON BEACH",null,"N",1]
[94930,"FAIRFAX",null,"N",1]
[94931,"COTATI",null,"N",1]
[94933,"FOREST KNOLLS",null,"N",1]
[94937,"INVERNESS",null,"N",1]
[94938,"LAGUNITAS",null,"N",1]
[94939,"LARKSPUR",null,"N",1]
[94940,"MARSHALL",null,"N",1]
[94941,"MILL VALLEY",null,"Y",1]
[94941,"MUIR WOODS",null,"Y",2]
[94941,"STRAWBERRY POINT",null,"Y",3]
[94941,"TAMALPAIS VALLEY",null,"Y",4]
[94942,"MILL VALLEY",null,"N",1]
[94945,"BLACK POINT",null,"Y",1]
[94945,"NOVATO",null,"Y",2]
[94945,"SAN MARIN",null,"Y",3]
[94946,"NICASIO",null,"N",1]
[94947,"NOVATO",null,"N",1]
[94948,"NOVATO",null,"N",1]
[94949,"BEL MARIN KEYES",null,"Y",1]
[94949,"IGNACIO",null,"Y",2]
[94949,"NOVATO",null,"Y",3]
[94950,"OLEMA",null,"N",1]
[94951,"PENNGROVE",null,"N",1]
[94952,"BLOOMFIELD",null,"Y",1]
[94952,"FALLON",null,"Y",2]
[94952,"LAKEVILLE",null,"Y",3]
[94952,"PETALUMA",null,"Y",4]
[94952,"TWO ROCK COAST GUARD STATION",null,"Y",5]
[94952,"TWO ROCK RANCH STA",null,"Y",6]
[94953,"PETALUMA",null,"N",1]
[94954,"PETALUMA",null,"N",1]
[94955,"PETALUMA",null,"N",1]
[94956,"POINT REYES STATION",null,"Y",1]
[94956,"PT REYES STATION",null,"Y",2]
[94957,"ROSS",null,"N",1]
[94960,"SAN ANSELMO",null,"N",1]
[94963,"SAN GERONIMO",null,"N",1]
[94964,"SAN QUENTIN",null,"N",1]
[94965,"FORT BAKER",null,"Y",1]
[94965,"FORT BARRY",null,"Y",2]
[94965,"FORT CRONKHITE",null,"Y",3]
[94965,"MARIN CITY",null,"Y",4]
[94965,"MUIR BEACH",null,"Y",5]
[94965,"SAUSALITO",null,"Y",6]
[94966,"SAUSALITO",null,"N",1]
[94970,"STINSON BEACH",null,"N",1]
[94971,"TOMALES",null,"N",1]
[94972,"VALLEY FORD",null,"N",1]
[94973,"WOODACRE",null,"N",1]
[94974,"SAN QUENTIN",null,"Y",1]
[94974,"TAMAL",null,"Y",2]
[94975,"NORTH BAY",null,"Y",1]
[94975,"PETALUMA",null,"Y",2]
[94976,"CORTE MADERA",null,"N",1]
[94977,"LARKSPUR",null,"N",1]
[94978,"FAIRFAX",null,"N",1]
[94979,"SAN ANSELMO",null,"N",1]
[94998,"NOVATO",null,"N",1]
[94999,"PETALUMA",null,"N",1]
[95001,"APTOS",null,"N",1]
[95002,"ALVISO",null,"N",1]
[95003,"APTOS",null,"Y",1]
[95003,"RIO DEL MAR",null,"Y",2]
[95003,"SEACLIFF",null,"Y",3]
[95003,"SEASCAPE",null,"Y",4]
[95004,"AROMAS",null,"N",1]
[95005,"BEN LOMOND",null,"N",1]
[95006,"BIG BASIN",null,"Y",1]
[95006,"BOULDER CREEK",null,"Y",2]
[95007,"BROOKDALE",null,"N",1]
[95008,"CAMPBELL",null,"N",1]
[95009,"CAMPBELL",null,"N",1]
[95010,"CAPITOLA",null,"N",1]
[95011,"CAMPBELL",null,"N",1]
[95012,"CASTROVILLE",null,"N",1]
[95013,"COYOTE",null,"N",1]
[95014,"CUPERTINO",null,"Y",1]
[95014,"MONTE VISTA",null,"Y",2]
[95014,"PERMANENTE",null,"Y",3]
[95015,"CUPERTINO",null,"N",1]
[95016,"CUPERTINO",null,"N",1]
[95017,"DAVENPORT",null,"N",1]
[95018,"FELTON",null,"Y",1]
[95018,"LOMPICO",null,"Y",2]
[95019,"FREEDOM",null,"N",1]
[95020,"GILROY",null,"N",1]
[95021,"GILROY",null,"N",1]
[95023,"HOLLISTER",null,"N",1]
[95024,"HOLLISTER",null,"N",1]
[95026,"HOLY CITY",null,"N",1]
[95030,"LOS GATOS",null,"Y",1]
[95030,"MONTE SERENO",null,"Y",2]
[95031,"LOS GATOS",null,"N",1]
[95032,"LOS GATOS",null,"N",1]
[95033,"LOS GATOS",null,"N",1]
[95035,"MILPITAS",null,"N",1]
[95036,"MILPITAS",null,"N",1]
[95037,"MORGAN HILL",null,"N",1]
[95038,"MORGAN HILL",null,"N",1]
[95039,"MOSS LANDING",null,"N",1]
[95041,"MOUNT HERMON",null,"N",1]
[95042,"NEW ALMADEN",null,"N",1]
[95043,"NEW IDRIA",null,"Y",1]
[95043,"PAICINES",null,"Y",2]
[95043,"PANOCHE",null,"Y",3]
[95043,"PINNACLES",null,"Y",4]
[95043,"SAN BENITO",null,"Y",5]
[95044,"HOLY CITY",null,"Y",1]
[95044,"REDWOOD ESTATES",null,"Y",2]
[95045,"SAN JUAN BAUTISTA",null,"N",1]
[95046,"SAN MARTIN",null,"N",1]
[95050,"SANTA CLARA",null,"N",1]
[95051,"SANTA CLARA",null,"N",1]
[95052,"SANTA CLARA",null,"N",1]
[95053,"SANTA CLARA",null,"N",1]
[95054,"SANTA CLARA",null,"N",1]
[95055,"SANTA CLARA",null,"N",1]
[95056,"SANTA CLARA",null,"N",1]
[95060,"BONNY DOON",null,"Y",1]
[95060,"PARADISE PARK",null,"Y",2]
[95060,"SANTA CRUZ",null,"Y",3]
[95061,"SANTA CRUZ",null,"N",1]
[95062,"SANTA CRUZ",null,"N",1]
[95063,"SANTA CRUZ",null,"N",1]
[95064,"SANTA CRUZ",null,"N",1]
[95065,"SANTA CRUZ",null,"N",1]
[95066,"SANTA CRUZ",null,"Y",1]
[95066,"SCOTTS VALLEY",null,"Y",2]
[95067,"SANTA CRUZ",null,"Y",1]
[95067,"SCOTTS VALLEY",null,"Y",2]
[95070,"SARATOGA",null,"N",1]
[95071,"SARATOGA",null,"N",1]
[95073,"SOQUEL",null,"N",1]
[95075,"TRES PINOS",null,"N",1]
[95076,"CORRALITOS",null,"Y",1]
[95076,"ELKHORN",null,"Y",2]
[95076,"LA SELVA BEACH",null,"Y",3]
[95076,"LAS LOMAS",null,"Y",4]
[95076,"PAJARO",null,"Y",5]
[95076,"WATSONVILLE",null,"Y",6]
[95077,"WATSONVILLE",null,"N",1]
[95101,"SAN JOSE",null,"N",1]
[95102,"SAN JOSE",null,"N",1]
[95103,"SAN JOSE",null,"N",1]
[95106,"SAN JOSE",null,"N",1]
[95108,"SAN JOSE",null,"N",1]
[95109,"SAN JOSE",null,"N",1]
[95110,"SAN JOSE",null,"N",1]
[95111,"SAN JOSE",null,"N",1]
[95112,"SAN JOSE",null,"N",1]
[95113,"SAN JOSE",null,"N",1]
[95114,"SAN JOSE",null,"N",1]
[95115,"SAN JOSE",null,"N",1]
[95116,"SAN JOSE",null,"N",1]
[95117,"SAN JOSE",null,"N",1]
[95118,"SAN JOSE",null,"N",1]
[95119,"SAN JOSE",null,"N",1]
[95120,"SAN JOSE",null,"N",1]
[95121,"SAN JOSE",null,"N",1]
[95122,"SAN JOSE",null,"N",1]
[95123,"SAN JOSE",null,"N",1]
[95124,"SAN JOSE",null,"N",1]
[95125,"SAN JOSE",null,"N",1]
[95126,"SAN JOSE",null,"N",1]
[95127,"SAN JOSE",null,"N",1]
[95128,"SAN JOSE",null,"N",1]
[95129,"SAN JOSE",null,"N",1]
[95130,"SAN JOSE",null,"N",1]
[95131,"SAN JOSE",null,"N",1]
[95132,"SAN JOSE",null,"N",1]
[95133,"SAN JOSE",null,"N",1]
[95134,"SAN JOSE",null,"N",1]
[95135,"SAN JOSE",null,"N",1]
[95136,"SAN JOSE",null,"N",1]
[95137,"SAN JOSE",null,"N",1]
[95138,"SAN JOSE",null,"N",1]
[95139,"SAN JOSE",null,"N",1]
[95140,"MOUNT HAMILTON",null,"Y",1]
[95140,"SAN JOSE",null,"Y",2]
[95141,"SAN JOSE",null,"N",1]
[95142,"SAN JOSE",null,"N",1]
[95148,"SAN JOSE",null,"N",1]
[95150,"SAN JOSE",null,"N",1]
[95151,"SAN JOSE",null,"N",1]
[95152,"SAN JOSE",null,"N",1]
[95153,"SAN JOSE",null,"N",1]
[95154,"SAN JOSE",null,"N",1]
[95155,"SAN JOSE",null,"N",1]
[95156,"SAN JOSE",null,"N",1]
[95157,"SAN JOSE",null,"N",1]
[95158,"SAN JOSE",null,"N",1]
[95159,"SAN JOSE",null,"N",1]
[95160,"SAN JOSE",null,"N",1]
[95161,"SAN JOSE",null,"N",1]
[95164,"SAN JOSE",null,"N",1]
[95170,"SAN JOSE",null,"N",1]
[95171,"SAN JOSE",null,"N",1]
[95172,"SAN JOSE",null,"N",1]
[95173,"SAN JOSE",null,"N",1]
[95190,"SAN JOSE",null,"N",1]
[95191,"SAN JOSE",null,"N",1]
[95192,"SAN JOSE",null,"N",1]
[95193,"SAN JOSE",null,"N",1]
[95194,"SAN JOSE",null,"N",1]
[95196,"SAN JOSE",null,"N",1]
[95201,"STOCKTON",null,"N",1]
[95202,"STOCKTON",null,"N",1]
[95203,"STOCKTON",null,"N",1]
[95204,"STOCKTON",null,"N",1]
[95205,"STOCKTON",null,"N",1]
[95206,"STOCKTON",null,"N",1]
[95207,"STOCKTON",null,"N",1]
[95208,"STOCKTON",null,"N",1]
[95209,"STOCKTON",null,"N",1]
[95210,"STOCKTON",null,"N",1]
[95211,"STOCKTON",null,"N",1]
[95212,"STOCKTON",null,"N",1]
[95213,"STOCKTON",null,"N",1]
[95215,"STOCKTON",null,"N",1]
[95219,"STOCKTON",null,"N",1]
[95220,"ACAMPO",null,"N",1]
[95221,"ALTAVILLE",null,"Y",1]
[95221,"ANGELS CAMP",null,"Y",2]
[95222,"ANGELS CAMP",null,"N",1]
[95223,"ARNOLD",null,"Y",1]
[95223,"BEAR VALLEY",null,"Y",2]
[95223,"CAMP CONNELL",null,"Y",3]
[95223,"DORRINGTON",null,"Y",4]
[95224,"AVERY",null,"N",1]
[95225,"BURSON",null,"N",1]
[95226,"CAMPO SECO",null,"Y",1]
[95226,"VALLEY SPRINGS",null,"Y",2]
[95227,"CLEMENTS",null,"N",1]
[95228,"COPPEROPOLIS",null,"N",1]
[95229,"DOUGLAS FLAT",null,"Y",1]
[95229,"VALLECITO",null,"Y",2]
[95230,"FARMINGTON",null,"N",1]
[95231,"FRENCH CAMP",null,"N",1]
[95232,"GLENCOE",null,"N",1]
[95233,"HATHAWAY PINES",null,"N",1]
[95234,"HOLT",null,"N",1]
[95236,"LINDEN",null,"N",1]
[95237,"LOCKEFORD",null,"N",1]
[95240,"LODI",null,"N",1]
[95241,"LODI",null,"N",1]
[95242,"LODI",null,"N",1]
[95245,"MOKELUMNE HILL",null,"N",1]
[95246,"MOUNTAIN RANCH",null,"Y",1]
[95247,"MURPHYS",null,"N",1]
[95248,"RAIL ROAD FLAT",null,"Y",1]
[95249,"SAN ANDREAS",null,"N",1]
[95250,"SAN ANDREAS",null,"Y",1]
[95250,"SHEEP RANCH",null,"Y",2]
[95251,"VALLECITO",null,"N",1]
[95252,"VALLEY SPRINGS",null,"N",1]
[95253,"VICTOR",null,"N",1]
[95254,"WALLACE",null,"N",1]
[95255,"WEST POINT",null,"N",1]
[95257,"WILSEYVILLE",null,"N",1]
[95258,"WOODBRIDGE",null,"N",1]
[95267,"STOCKTON",null,"Y",1]
[95269,"STOCKTON",null,"Y",1]
[95290,"STOCKTON",null,"N",1]
[95296,"STOCKTON",null,"Y",3]
[95297,"STOCKTON",null,"Y",1]
[95298,"STOCKTON",null,"N",1]
[95301,"ATWATER",null,"N",1]
[95301,"ATWATER",null,"N",1]
[95303,"BALLICO",null,"N",1]
[95304,"BANTA",null,"Y",1]
[95304,"TRACY",null,"Y",2]
[95305,"BIG OAK FLAT",null,"N",1]
[95306,"CATHEYS VALLEY",null,"N",1]
[95307,"CERES",null,"N",1]
[95309,"CHINESE CAMP",null,"N",1]
[95310,"COLUMBIA",null,"N",1]
[95311,"COULTERVILLE",null,"Y",1]
[95311,"GREELEY HILL",null,"Y",2]
[95312,"CRESSEY",null,"N",1]
[95313,"CROWS LANDING",null,"N",1]
[95314,"DARDANELLE",null,"Y",1]
[95314,"PINECREST",null,"Y",2]
[95315,"DELHI",null,"N",1]
[95316,"DENAIR",null,"N",1]
[95317,"EL NIDO",null,"N",1]
[95318,"EL PORTAL",null,"N",1]
[95319,"EMPIRE",null,"N",1]
[95320,"ESCALON",null,"N",1]
[95321,"GROVELAND",null,"N",1]
[95322,"GUSTINE",null,"Y",1]
[95322,"SANTA NELLA",null,"Y",2]
[95323,"HICKMAN",null,"N",1]
[95324,"HILMAR",null,"N",1]
[95325,"HORNITOS",null,"N",1]
[95326,"HUGHSON",null,"N",1]
[95327,"JAMESTOWN",null,"N",1]
[95328,"KEYES",null,"N",1]
[95329,"LA GRANGE",null,"N",1]
[95330,"LATHROP",null,"N",1]
[95333,"LE GRAND",null,"N",1]
[95334,"LIVINGSTON",null,"N",1]
[95335,"COLD SPRINGS",null,"Y",1]
[95335,"LONG BARN",null,"Y",2]
[95336,"MANTECA",null,"N",1]
[95337,"MANTECA",null,"N",1]
[95338,"MARIPOSA",null,"N",1]
[95340,"MERCED",null,"N",1]
[95341,"MERCED",null,"N",1]
[95342,"ATWATER",null,"Y",1]
[95342,"ATWATER",null,"Y",2]
[95342,"MERCED",null,"Y",3]
[95343,"MERCED",null,"N",1]
[95344,"MERCED",null,"N",1]
[95345,"MIDPINES",null,"N",1]
[95346,"MI WUK VILLAGE",null,"N",1]
[95347,"MOCCASIN",null,"N",1]
[95348,"MERCED",null,"N",1]
[95350,"MODESTO",null,"N",1]
[95351,"MODESTO",null,"N",1]
[95352,"MODESTO",null,"N",1]
[95353,"MODESTO",null,"N",1]
[95354,"MODESTO",null,"N",1]
[95355,"MODESTO",null,"N",1]
[95356,"MODESTO",null,"N",1]
[95357,"MODESTO",null,"N",1]
[95358,"MODESTO",null,"N",1]
[95360,"NEWMAN",null,"N",1]
[95361,"KNIGHTS FERRY",null,"Y",1]
[95361,"OAKDALE",null,"Y",2]
[95361,"VALLEY HOME",null,"Y",3]
[95363,"PATTERSON",null,"Y",2]
[95364,"PINECREST",null,"N",1]
[95365,"PLANADA",null,"N",1]
[95366,"RIPON",null,"N",1]
[95367,"RIVERBANK",null,"N",1]
[95368,"SALIDA",null,"N",1]
[95369,"SNELLING",null,"N",1]
[95370,"SONORA",null,"N",1]
[95372,"SOULSBYVILLE",null,"N",1]
[95373,"SONORA",null,"Y",1]
[95373,"STANDARD",null,"Y",2]
[95374,"STEVINSON",null,"N",1]
[95375,"PINECREST",null,"Y",1]
[95375,"STRAWBERRY",null,"Y",2]
[95376,"TRACY",null,"N",1]
[95378,"TRACY",null,"N",1]
[95379,"TUOLUMNE",null,"N",1]
[95380,"TURLOCK",null,"N",1]
[95381,"TURLOCK",null,"N",1]
[95382,"TURLOCK",null,"N",1]
[95383,"TWAIN HARTE",null,"N",1]
[95385,"TRACY",null,"Y",1]
[95385,"VERNALIS",null,"Y",2]
[95386,"WATERFORD",null,"N",1]
[95387,"WESTLEY",null,"N",1]
[95388,"WINTON",null,"N",1]
[95389,"TUOLUMNE MEADOWS",null,"Y",1]
[95389,"WAWONA",null,"Y",3]
[95389,"YOSEMITE",null,"Y",4]
[95389,"YOSEMITE NATIONAL PARK",null,"Y",5]
[95390,"RIVERBANK",null,"N",1]
[95397,"MODESTO",null,"N",1]
[95401,"SANTA ROSA",null,"N",1]
[95402,"SANTA ROSA",null,"N",1]
[95403,"LARKFIELD",null,"Y",1]
[95403,"SANTA ROSA",null,"Y",2]
[95404,"SANTA ROSA",null,"N",1]
[95405,"SANTA ROSA",null,"N",1]
[95406,"SANTA ROSA",null,"N",1]
[95407,"ROSELAND",null,"Y",1]
[95407,"SANTA ROSA",null,"Y",2]
[95408,"SANTA ROSA",null,"N",1]
[95409,"SANTA ROSA",null,"Y",2]
[95410,"ALBION",null,"N",1]
[95412,"ANNAPOLIS",null,"N",1]
[95415,"BOONVILLE",null,"N",1]
[95416,"B H SPRINGS",null,"Y",1]
[95416,"BOYES HOT SPRINGS",null,"Y",2]
[95416,"BOYES SPRINGS",null,"Y",3]
[95416,"FETTERS HOT SPRINGS",null,"Y",4]
[95417,"BRANSCOMB",null,"Y",1]
[95417,"LAYTONVILLE",null,"Y",2]
[95418,"CALPELLA",null,"Y",1]
[95418,"UKIAH",null,"Y",2]
[95419,"CAMP MEEKER",null,"N",1]
[95420,"CASPAR",null,"N",1]
[95421,"CAZADERO",null,"N",1]
[95422,"CLEARLAKE",null,"N",1]
[95423,"CLEARLAKE OAKS",null,"Y",1]
[95423,"SULPHUR BANK RANCHERIA",null,"Y",3]
[95424,"CLEARLAKE PARK",null,"N",1]
[95425,"ASTI",null,"Y",1]
[95425,"CLOVERDALE",null,"Y",2]
[95425,"THE GEYSERS",null,"Y",3]
[95426,"COBB",null,"N",1]
[95427,"COMPTCHE",null,"Y",1]
[95427,"KEENE SUMMIT",null,"Y",2]
[95428,"COVELO",null,"N",1]
[95429,"DOS RIOS",null,"Y",1]
[95429,"WILLITS",null,"Y",2]
[95430,"DUNCANS MILLS",null,"N",1]
[95431,"ELDRIDGE",null,"N",1]
[95432,"ELK",null,"N",1]
[95433,"EL VERANO",null,"N",1]
[95435,"FINLEY",null,"N",1]
[95436,"FORESTVILLE",null,"N",1]
[95437,"CLEONE",null,"Y",1]
[95437,"FORT BRAGG",null,"Y",2]
[95437,"INGLENOOK",null,"Y",3]
[95437,"NOYO",null,"Y",4]
[95437,"PUDDING CREEK",null,"Y",5]
[95437,"REDWOOD LODGE",null,"Y",6]
[95437,"SHERWOOD VALLEY RANCHERIA",null,"Y",7]
[95439,"FULTON",null,"N",1]
[95441,"ALEXANDER VALLEY",null,"Y",1]
[95441,"GEYSERVILLE",null,"Y",2]
[95442,"GLEN ELLEN",null,"N",1]
[95443,"GLENHAVEN",null,"N",1]
[95444,"GRATON",null,"N",1]
[95445,"ANCHOR BAY",null,"Y",1]
[95445,"GUALALA",null,"Y",2]
[95446,"GUERNEVILLE",null,"Y",1]
[95446,"GUERNEWOOD",null,"Y",2]
[95448,"HEALDSBURG",null,"N",1]
[95449,"HOPLAND",null,"N",1]
[95450,"FORT ROSS",null,"Y",1]
[95450,"JENNER",null,"Y",2]
[95451,"KELSEYVILLE",null,"N",1]
[95452,"KENWOOD",null,"N",1]
[95453,"LAKEPORT",null,"N",1]
[95454,"LAYTONVILLE",null,"Y",1]
[95454,"LAYTONVILLE RANCHERIA",null,"Y",2]
[95456,"LITTLERIVER",null,"N",1]
[95457,"LOWER LAKE",null,"N",1]
[95458,"LUCERNE",null,"N",1]
[95459,"MANCHESTER",null,"Y",1]
[95459,"MANCHESTER RANCHERIA",null,"Y",2]
[95460,"MENDOCINO",null,"N",1]
[95461,"ANDERSON SPRINGS",null,"Y",1]
[95461,"LOCH LOMOND",null,"Y",2]
[95461,"MIDDLETOWN",null,"Y",3]
[95462,"MONTE RIO",null,"Y",1]
[95462,"RUSSIAN RIVER MDWS",null,"Y",2]
[95463,"NAVARRO",null,"Y",1]
[95463,"PHILO",null,"Y",2]
[95464,"NICE",null,"N",1]
[95465,"OCCIDENTAL",null,"N",1]
[95466,"PHILO",null,"N",1]
[95468,"POINT ARENA",null,"Y",1]
[95468,"POINT ARENA AIR FORCE STATIO",null,"Y",2]
[95469,"POTTER VALLEY",null,"N",1]
[95470,"REDWOOD VALLEY",null,"N",1]
[95471,"RIO NIDO",null,"N",1]
[95472,"FREESTONE",null,"Y",1]
[95472,"SEBASTOPOL",null,"Y",2]
[95473,"SEBASTOPOL",null,"N",1]
[95476,"AGUA CALIENTE",null,"Y",1]
[95476,"SCHELLVILLE",null,"Y",2]
[95476,"SONOMA",null,"Y",3]
[95480,"STEWARTS POINT",null,"Y",1]
[95480,"STEWARTS POINT RANCHERIA",null,"Y",2]
[95481,"TALMAGE",null,"N",1]
[95482,"UKIAH",null,"N",1]
[95485,"UPPER LAKE",null,"N",1]
[95486,"SHERIDAN",null,"Y",1]
[95486,"VILLA GRANDE",null,"Y",2]
[95487,"VINEBURG",null,"N",1]
[95488,"FORT BRAGG",null,"Y",1]
[95488,"ROCKPORT",null,"Y",2]
[95488,"WESTPORT",null,"Y",3]
[95490,"WILLITS",null,"N",1]
[95492,"WINDSOR",null,"N",1]
[95493,"UPPER LAKE",null,"Y",1]
[95493,"WITTER SPRINGS",null,"Y",2]
[95494,"YORKVILLE",null,"N",1]
[95497,"SEA RANCH",null,"Y",1]
[95497,"THE SEA RANCH",null,"Y",2]
[95501,"CUTTEN",null,"Y",1]
[95501,"EUREKA",null,"Y",2]
[95502,"EUREKA",null,"N",1]
[95503,"EUREKA",null,"N",1]
[95511,"ALDERPOINT",null,"N",1]
[95514,"BLOCKSBURG",null,"N",1]
[95518,"ARCATA",null,"N",1]
[95519,"ARCATA",null,"Y",1]
[95519,"MCKINLEYVILLE",null,"Y",2]
[95521,"ARCATA",null,"Y",1]
[95521,"MANILA",null,"Y",2]
[95521,"MC KINLEYVILLE",null,"Y",3]
[95521,"MCKINLEYVILLE",null,"Y",4]
[95524,"BAYSIDE",null,"N",1]
[95525,"BLUE LAKE",null,"N",1]
[95526,"BRIDGEVILLE",null,"Y",1]
[95526,"RUTH",null,"Y",2]
[95527,"BURNT RANCH",null,"N",1]
[95528,"CARLOTTA",null,"N",1]
[95531,"CRESCENT CITY",null,"Y",1]
[95531,"NORTHCREST",null,"Y",2]
[95532,"CRESCENT CITY",null,"N",1]
[95534,"CUTTEN",null,"Y",1]
[95534,"EUREKA",null,"Y",2]
[95536,"FERNDALE",null,"N",1]
[95537,"FIELDS LANDING",null,"N",1]
[95538,"CRESCENT CITY",null,"Y",1]
[95538,"FORT DICK",null,"Y",2]
[95540,"FORTUNA",null,"N",1]
[95542,"GARBERVILLE",null,"N",1]
[95543,"GASQUET",null,"N",1]
[95545,"HONEYDEW",null,"N",1]
[95546,"HOOPA",null,"Y",1]
[95546,"HOOPA VALLEY INDIAN RESERVAT",null,"Y",2]
[95546,"RESIGHINI RANCHERIA",null,"Y",3]
[95546,"WEITCHPEC",null,"Y",4]
[95547,"HYDESVILLE",null,"N",1]
[95548,"KLAMATH",null,"Y",1]
[95548,"KLAMATH AIR FORCE STATION",null,"Y",2]
[95549,"KNEELAND",null,"N",1]
[95550,"KORBEL",null,"N",1]
[95551,"LOLETA",null,"N",1]
[95552,"MAD RIVER",null,"N",1]
[95553,"MIRANDA",null,"N",1]
[95554,"MYERS FLAT",null,"N",1]
[95555,"ORICK",null,"N",1]
[95556,"ORLEANS",null,"N",1]
[95558,"PETROLIA",null,"N",1]
[95559,"PHILLIPSVILLE",null,"N",1]
[95560,"REDWAY",null,"N",1]
[95562,"RIO DELL",null,"N",1]
[95563,"SALYER",null,"N",1]
[95564,"SAMOA",null,"N",1]
[95565,"SCOTIA",null,"N",1]
[95567,"SMITH RIVER",null,"N",1]
[95568,"SOMES BAR",null,"Y",1]
[95568,"SOMESBAR",null,"Y",2]
[95569,"REDCREST",null,"N",1]
[95570,"TRINIDAD",null,"Y",1]
[95570,"WESTHAVEN",null,"Y",2]
[95571,"WEOTT",null,"N",1]
[95573,"WILLOW CREEK",null,"N",1]
[95585,"LEGGETT",null,"N",1]
[95587,"PIERCY",null,"N",1]
[95589,"WHITETHORN",null,"N",1]
[95595,"ZENIA",null,"N",1]
[95601,"AMADOR CITY",null,"N",1]
[95602,"AUBURN",null,"Y",1]
[95602,"AUBURN",null,"Y",2]
[95603,"AUBURN",null,"Y",1]
[95603,"AUBURN",null,"Y",2]
[95603,"CHRISTIAN VALLEY",null,"Y",3]
[95603,"CLIPPER GAP",null,"Y",4]
[95603,"LAKE OF THE PINES",null,"Y",5]
[95603,"OPHIR",null,"Y",6]
[95604,"AUBURN",null,"Y",1]
[95604,"AUBURN",null,"Y",2]
[95604,"BOWMAN",null,"Y",3]
[95605,"BRODERICK",null,"Y",1]
[95605,"BRYTE",null,"Y",2]
[95605,"RIVER BANK",null,"Y",3]
[95605,"WEST SACRAMENTO",null,"Y",4]
[95606,"BROOKS",null,"N",1]
[95607,"CAPAY",null,"Y",1]
[95607,"ESPARTO",null,"Y",2]
[95608,"CARMICHAEL",null,"N",1]
[95609,"CARMICHAEL",null,"N",1]
[95610,"CITRUS HEIGHTS",null,"N",1]
[95611,"CITRUS HEIGHTS",null,"N",1]
[95612,"CLARKSBURG",null,"N",1]
[95613,"COLOMA",null,"N",1]
[95614,"AUBURN LAKE TRAILS",null,"Y",1]
[95614,"COOL",null,"Y",2]
[95615,"COURTLAND",null,"Y",1]
[95615,"PAINTERSVILLE",null,"Y",2]
[95615,"RANDALL ISLAND",null,"Y",3]
[95615,"SUTTER ISLAND",null,"Y",4]
[95616,"DAVIS",null,"N",1]
[95617,"DAVIS",null,"N",1]
[95618,"DAVIS",null,"Y",1]
[95618,"EL MACERO",null,"Y",2]
[95619,"DIAMOND SPRINGS",null,"N",1]
[95620,"DIXON",null,"Y",1]
[95620,"LIBERTY FARMS",null,"Y",2]
[95621,"CITRUS HEIGHTS",null,"N",1]
[95623,"EL DORADO",null,"Y",1]
[95623,"NASHVILLE",null,"Y",2]
[95624,"ELK GROVE",null,"N",1]
[95625,"ELMIRA",null,"N",1]
[95626,"ELVERTA",null,"N",1]
[95627,"ESPARTO",null,"N",1]
[95628,"FAIR OAKS",null,"N",1]
[95629,"FIDDLETOWN",null,"N",1]
[95630,"FOLSOM",null,"Y",1]
[95630,"LAKE NATOMA",null,"Y",2]
[95630,"MORMON ISLAND",null,"Y",3]
[95630,"PINE BLUFF",null,"Y",4]
[95630,"WHITE ROCK",null,"Y",5]
[95631,"BAKER RANCH",null,"Y",1]
[95631,"FORESTHILL",null,"Y",2]
[95631,"MICHIGAN BLUFF",null,"Y",3]
[95631,"TODD VALLEY",null,"Y",4]
[95632,"GALT",null,"N",1]
[95633,"GARDEN VALLEY",null,"N",1]
[95634,"BUFFALO HILL",null,"Y",1]
[95634,"GEORGETOWN",null,"Y",2]
[95634,"VIRNER",null,"Y",3]
[95634,"VOLCANOVILLE",null,"Y",4]
[95634,"WENTWORTH SPRINGS",null,"Y",5]
[95635,"GREENWOOD",null,"N",1]
[95636,"GRIZZLY FLATS",null,"N",1]
[95637,"GUINDA",null,"N",1]
[95638,"CLAY",null,"Y",1]
[95638,"HERALD",null,"Y",2]
[95639,"HOOD",null,"N",1]
[95640,"CAMANCHE LAKE",null,"Y",1]
[95640,"CARBONDALE",null,"Y",2]
[95640,"IONE",null,"Y",3]
[95640,"SUNNYBROOK",null,"Y",4]
[95641,"ANDRUS ISLAND",null,"Y",1]
[95641,"BOULDIN ISLAND",null,"Y",2]
[95641,"BRANNAN ISLAND",null,"Y",3]
[95641,"ISLETON",null,"Y",4]
[95642,"CLINTON",null,"Y",1]
[95642,"JACKSON",null,"Y",2]
[95644,"KIT CARSON",null,"Y",1]
[95644,"PIONEER",null,"Y",2]
[95645,"KNIGHTS LANDING",null,"N",1]
[95646,"AMADOR STATION",null,"Y",1]
[95646,"BLACK STATION",null,"Y",2]
[95646,"BUCKHORN",null,"Y",3]
[95646,"HAMS STATION",null,"Y",4]
[95646,"IRON MOUNTAIN",null,"Y",5]
[95646,"KIRKWOOD",null,"Y",6]
[95646,"PEDDLER HILL",null,"Y",7]
[95646,"PIONEER",null,"Y",8]
[95646,"PLASSE",null,"Y",9]
[95648,"LINCOLN",null,"N",1]
[95650,"LOOMIS",null,"N",1]
[95651,"LOTUS",null,"N",1]
[95652,"MCCLELLAN AFB",null,"Y",1]
[95652,"NORTH HIGHLANDS",null,"Y",2]
[95653,"MADISON",null,"N",1]
[95654,"JACKSON",null,"Y",1]
[95654,"MARTELL",null,"Y",2]
[95655,"MATHER",null,"N",1]
[95656,"MOUNT AUKUM",null,"N",1]
[95658,"NEWCASTLE",null,"N",1]
[95659,"EAST NICOLAUS",null,"Y",1]
[95659,"NICOLAUS",null,"Y",2]
[95659,"TROWBRIDGE",null,"Y",3]
[95659,"VERONA",null,"Y",4]
[95659,"VERONA LANDING",null,"Y",5]
[95660,"NORTH HIGHLANDS",null,"N",1]
[95661,"ROSEVILLE",null,"N",1]
[95662,"ORANGEVALE",null,"Y",1]
[95662,"OVALE",null,"Y",2]
[95663,"PENRYN",null,"N",1]
[95664,"PILOT HILL",null,"N",1]
[95665,"PINE GROVE",null,"N",1]
[95666,"PIONEER",null,"Y",1]
[95666,"SILVER LAKE",null,"Y",2]
[95667,"BUCKS BAR",null,"Y",1]
[95667,"CEDAR RAVINE",null,"Y",2]
[95667,"FIVE MILE TERRACE",null,"Y",3]
[95667,"GOLD HILL",null,"Y",4]
[95667,"KELSEY",null,"Y",5]
[95667,"NEWTOWN",null,"Y",6]
[95667,"OLD FORT JIM",null,"Y",7]
[95667,"PLACERVILLE",null,"Y",8]
[95667,"PLEASANT VALLEY",null,"Y",9]
[95667,"SWANSBORO COUNTRY",null,"Y",10]
[95668,"PLEASANT GROVE",null,"N",1]
[95669,"PLYMOUTH",null,"N",1]
[95670,"GOLD RIVER",null,"Y",1]
[95670,"NIMBUS",null,"Y",2]
[95670,"RANCHO CORDOVA",null,"Y",3]
[95671,"FOLSOM",null,"Y",1]
[95671,"REPRESA",null,"Y",2]
[95672,"RESCUE",null,"N",1]
[95673,"RIO LINDA",null,"N",1]
[95674,"RIO OSO",null,"N",1]
[95675,"MOUNT AUKUM",null,"Y",1]
[95675,"RIVER PINES",null,"Y",2]
[95676,"ROBBINS",null,"N",1]
[95677,"ROCKLIN",null,"Y",1]
[95677,"STANFORD RANCH",null,"Y",2]
[95677,"SUNSET WHITNEY RANCH",null,"Y",3]
[95678,"ROSEVILLE",null,"N",1]
[95679,"RUMSEY",null,"N",1]
[95680,"RYDE",null,"N",1]
[95681,"SHERIDAN",null,"N",1]
[95682,"CAMERON PARK",null,"Y",1]
[95682,"LATROBE",null,"Y",2]
[95682,"SHINGLE SPRINGS",null,"Y",3]
[95683,"RANCHO MURIETA",null,"Y",1]
[95683,"SLOUGHHOUSE",null,"Y",2]
[95684,"FAIR PLAY",null,"Y",1]
[95684,"OMO RANCH",null,"Y",2]
[95684,"OUTINGDALE",null,"Y",3]
[95684,"SOMERSET",null,"Y",4]
[95685,"SUTTER CREEK",null,"Y",1]
[95685,"SUTTER HILL",null,"Y",2]
[95686,"THORNTON",null,"N",1]
[95687,"VACAVILLE",null,"N",1]
[95688,"ALLENDALE",null,"Y",1]
[95688,"VACAVILLE",null,"Y",2]
[95689,"VOLCANO",null,"N",1]
[95690,"EAGLE TREE",null,"Y",1]
[95690,"GRAND ISLAND",null,"Y",2]
[95690,"HOWARD LANDING",null,"Y",3]
[95690,"LOCKE",null,"Y",4]
[95690,"LONG ISLAND",null,"Y",5]
[95690,"RYER ISLAND",null,"Y",6]
[95690,"VORDEN",null,"Y",7]
[95690,"WALKER LANDING",null,"Y",8]
[95690,"WALNUT GROVE",null,"Y",9]
[95691,"SOUTHPORT",null,"Y",1]
[95691,"WEST SACRAMENTO",null,"Y",2]
[95692,"WHEATLAND",null,"N",1]
[95693,"WILTON",null,"N",1]
[95694,"WINTERS",null,"N",1]
[95695,"WOODLAND",null,"N",1]
[95696,"NUT TREE",null,"Y",1]
[95696,"VACAVILLE",null,"Y",2]
[95697,"YOLO",null,"N",1]
[95698,"ZAMORA",null,"N",1]
[95699,"DRYTOWN",null,"Y",1]
[95699,"SUTTER CREEK",null,"Y",2]
[95701,"ALTA",null,"N",1]
[95703,"APPLEGATE",null,"Y",1]
[95703,"HEATHER GLEN",null,"Y",2]
[95709,"CAMINO",null,"Y",1]
[95709,"CEDAR GROVE",null,"Y",2]
[95709,"EIGHT MILE HOUSE",null,"Y",3]
[95709,"SNOWLINE CAMP",null,"Y",4]
[95712,"CHICAGO PARK",null,"N",1]
[95713,"CAPE HORN",null,"Y",1]
[95713,"COLFAX",null,"Y",2]
[95713,"EDEN VALLEY",null,"Y",3]
[95713,"IOWA HILL",null,"Y",4]
[95713,"SHADY GLEN",null,"Y",5]
[95713,"YANKEE JIMS",null,"Y",6]
[95714,"DUTCH FLAT",null,"N",1]
[95715,"ALTA",null,"Y",1]
[95715,"BLUE CANYON",null,"Y",2]
[95715,"EMIGRANT GAP",null,"Y",3]
[95717,"GOLD RUN",null,"Y",1]
[95717,"MAGRA",null,"Y",2]
[95720,"KYBURZ",null,"Y",1]
[95720,"SILVER FORK",null,"Y",2]
[95721,"ECHO LAKE",null,"Y",1]
[95721,"TWIN BRIDGES",null,"Y",2]
[95722,"MEADOW VISTA",null,"N",1]
[95724,"NORDEN",null,"Y",1]
[95724,"SODA SPRINGS",null,"Y",2]
[95726,"FRESH POND",null,"Y",1]
[95726,"PACIFIC HOUSE",null,"Y",2]
[95726,"POLLOCK PINES",null,"Y",3]
[95728,"CISCO",null,"Y",1]
[95728,"KINGVALE",null,"Y",2]
[95728,"SERENE LAKES",null,"Y",3]
[95728,"SODA SPRINGS",null,"Y",4]
[95728,"THE CEDARS",null,"Y",5]
[95735,"TWIN BRIDGES",null,"N",1]
[95736,"WEIMAR",null,"N",1]
[95741,"RANCHO CORDOVA",null,"N",1]
[95742,"RANCHO CORDOVA",null,"N",1]
[95743,"RANCHO CORDOVA",null,"N",1]
[95746,"GRANITE BAY",null,"Y",1]
[95746,"ROSEVILLE",null,"Y",2]
[95747,"ROSEVILLE",null,"N",1]
[95758,"ELK GROVE",null,"N",1]
[95759,"ELK GROVE",null,"N",1]
[95762,"EL DORADO HILLS",null,"Y",1]
[95762,"FOLSOM",null,"Y",2]
[95763,"FOLSOM",null,"N",1]
[95765,"ROCKLIN",null,"N",1]
[95776,"WOODLAND",null,"N",1]
[95798,"WEST SACRAMENTO",null,"N",1]
[95799,"WEST SACRAMENTO",null,"N",1]
[95812,"SACRAMENTO",null,"N",1]
[95813,"SACRAMENTO",null,"N",1]
[95814,"SACRAMENTO",null,"N",1]
[95815,"NORTH SACRAMENTO",null,"Y",1]
[95815,"SACRAMENTO",null,"Y",2]
[95816,"SACRAMENTO",null,"N",1]
[95817,"SACRAMENTO",null,"N",1]
[95818,"SACRAMENTO",null,"N",1]
[95819,"SACRAMENTO",null,"N",1]
[95820,"FRUITRIDGE",null,"Y",1]
[95820,"SACRAMENTO",null,"Y",2]
[95821,"ARCADE",null,"Y",1]
[95821,"SACRAMENTO",null,"Y",2]
[95822,"SACRAMENTO",null,"N",1]
[95823,"SACRAMENTO",null,"N",1]
[95824,"SACRAMENTO",null,"N",1]
[95825,"SACRAMENTO",null,"N",1]
[95826,"SACRAMENTO",null,"Y",1]
[95826,"WALSH STATION",null,"Y",2]
[95827,"SACRAMENTO",null,"N",1]
[95828,"SACRAMENTO",null,"N",1]
[95829,"SACRAMENTO",null,"N",1]
[95830,"SACRAMENTO",null,"N",1]
[95831,"SACRAMENTO",null,"N",1]
[95832,"SACRAMENTO",null,"N",1]
[95833,"SACRAMENTO",null,"N",1]
[95834,"SACRAMENTO",null,"N",1]
[95835,"SACRAMENTO",null,"N",1]
[95836,"SACRAMENTO",null,"N",1]
[95837,"SACRAMENTO",null,"N",1]
[95838,"SACRAMENTO",null,"N",1]
[95840,"SACRAMENTO",null,"N",1]
[95841,"SACRAMENTO",null,"N",1]
[95842,"SACRAMENTO",null,"N",1]
[95843,"ANTELOPE",null,"Y",1]
[95843,"SACRAMENTO",null,"Y",2]
[95851,"SACRAMENTO",null,"N",1]
[95852,"SACRAMENTO",null,"N",1]
[95853,"SACRAMENTO",null,"N",1]
[95857,"SACRAMENTO",null,"N",1]
[95860,"SACRAMENTO",null,"N",1]
[95864,"SACRAMENTO",null,"N",1]
[95865,"SACRAMENTO",null,"N",1]
[95866,"SACRAMENTO",null,"N",1]
[95867,"SACRAMENTO",null,"N",1]
[95873,"SACRAMENTO",null,"N",1]
[95887,"SACRAMENTO",null,"N",1]
[95894,"SACRAMENTO",null,"N",1]
[95899,"SACRAMENTO",null,"N",1]
[95901,"ARBOGA",null,"Y",1]
[95901,"HALLWOOD",null,"Y",2]
[95901,"HAMMONTON",null,"Y",3]
[95901,"LOMA RICA",null,"Y",4]
[95901,"MARYSVILLE",null,"Y",5]
[95903,"BEALE AFB",null,"Y",1]
[95903,"MARYSVILLE",null,"Y",2]
[95910,"ALLEGHANY",null,"Y",1]
[95910,"FOREST CITY",null,"Y",2]
[95912,"ARBUCKLE",null,"N",1]
[95913,"ARTOIS",null,"N",1]
[95914,"BANGOR",null,"N",1]
[95915,"BELDEN",null,"Y",1]
[95915,"CARIBOU",null,"Y",2]
[95915,"GANSER BAR",null,"Y",3]
[95915,"OROVILLE",null,"Y",4]
[95916,"BERRY CREEK",null,"Y",1]
[95916,"BRUSH CREEK",null,"Y",2]
[95917,"BIGGS",null,"N",1]
[95918,"BROWNS VALLEY",null,"N",1]
[95919,"BROWNSVILLE",null,"N",1]
[95920,"AFTON",null,"Y",1]
[95920,"BUTTE CITY",null,"Y",2]
[95922,"CAMPTONVILLE",null,"N",1]
[95923,"CANYONDAM",null,"Y",1]
[95923,"PRATTVILLE",null,"Y",2]
[95923,"SENECA",null,"Y",3]
[95924,"CEDAR RIDGE",null,"N",1]
[95925,"CHALLENGE",null,"Y",1]
[95925,"WOODLEAF",null,"Y",2]
[95926,"BUTTE CREEK",null,"Y",1]
[95926,"CHAPMANTOWN",null,"Y",2]
[95926,"CHICO",null,"Y",3]
[95926,"CHICO VECINO",null,"Y",4]
[95926,"COHASSET",null,"Y",5]
[95926,"DAYTON",null,"Y",6]
[95926,"NORD",null,"Y",7]
[95927,"CHICO",null,"N",1]
[95928,"CHICO",null,"N",1]
[95929,"CHICO",null,"N",1]
[95930,"CLIPPER MILLS",null,"N",1]
[95931,"COLLEGE CITY",null,"N",1]
[95932,"COLUSA",null,"N",1]
[95934,"CRESCENT MILLS",null,"N",1]
[95935,"DOBBINS",null,"N",1]
[95936,"DOWNIEVILLE",null,"N",1]
[95937,"DUNNIGAN",null,"N",1]
[95938,"DURHAM",null,"N",1]
[95939,"ELK CREEK",null,"Y",1]
[95939,"GRINDSTONE CREEK RANCHERIA",null,"Y",2]
[95940,"FEATHER FALLS",null,"Y",1]
[95940,"OROVILLE",null,"Y",2]
[95941,"FORBESTOWN",null,"N",1]
[95942,"BUTTE MEADOWS",null,"Y",1]
[95942,"FOREST RANCH",null,"Y",2]
[95943,"BAYLISS",null,"Y",1]
[95943,"GLENN",null,"Y",2]
[95943,"ORDBEND",null,"Y",3]
[95944,"GOODYEARS BAR",null,"N",1]
[95945,"ALTA HILL",null,"Y",1]
[95945,"ALTA SIERRA",null,"Y",2]
[95945,"BEAR RIVER PINES",null,"Y",3]
[95945,"BOSTON RAVINE",null,"Y",4]
[95945,"GLENBROOK HEIGHTS",null,"Y",5]
[95945,"GRASS VALLEY",null,"Y",6]
[95945,"HILLS FLAT",null,"Y",7]
[95945,"LA BARR MEADOWS",null,"Y",8]
[95945,"PEARDALE",null,"Y",9]
[95945,"SPRING HILL",null,"Y",10]
[95945,"SUNSET VIEW",null,"Y",11]
[95945,"UNION HILL",null,"Y",12]
[95945,"WILLAURA ESTATES",null,"Y",13]
[95946,"PENN VALLEY",null,"N",1]
[95947,"ALMANOR",null,"Y",1]
[95947,"GREENVILLE",null,"Y",2]
[95948,"EAST GRIDLEY",null,"Y",1]
[95948,"GRIDLEY",null,"Y",2]
[95948,"MANZANITA",null,"Y",3]
[95949,"GRASS VALLEY",null,"N",1]
[95950,"GRIMES",null,"N",1]
[95951,"HAMILTON CITY",null,"Y",1]
[95951,"MILLS ORCHARD",null,"Y",2]
[95953,"LIVE OAK",null,"Y",1]
[95953,"PENNINGTON",null,"Y",2]
[95954,"MAGALIA",null,"Y",1]
[95954,"NIMSHEW",null,"Y",2]
[95954,"PARADISE PINES",null,"Y",3]
[95955,"MAXWELL",null,"N",1]
[95956,"MEADOW VALLEY",null,"Y",1]
[95956,"SPANISH RANCH",null,"Y",2]
[95957,"MERIDIAN",null,"Y",1]
[95957,"SYCAMORE",null,"Y",2]
[95958,"DURHAM",null,"Y",1]
[95958,"NELSON",null,"Y",2]
[95959,"CHEROKEE",null,"Y",1]
[95959,"GRANITEVILLE",null,"Y",2]
[95959,"NEVADA CITY",null,"Y",3]
[95959,"NORTH BLOOMFIELD",null,"Y",4]
[95959,"NORTH COLUMBIA",null,"Y",5]
[95959,"TOWN TALK",null,"Y",6]
[95960,"N SAN JUAN",null,"Y",1]
[95960,"NORTH SAN JUAN",null,"Y",2]
[95960,"PIKE",null,"Y",3]
[95960,"SWEETLAND",null,"Y",4]
[95961,"OLIVEHURST",null,"N",1]
[95962,"OREGON HOUSE",null,"Y",1]
[95962,"RENAISSANCE",null,"Y",2]
[95963,"NEWVILLE",null,"Y",1]
[95963,"ORLAND",null,"Y",2]
[95965,"BUTTE VALLEY",null,"Y",1]
[95965,"CHEROKEE",null,"Y",2]
[95965,"HONCUT",null,"Y",3]
[95965,"HURLETON",null,"Y",4]
[95965,"JARBO",null,"Y",5]
[95965,"LAS PLUMAS",null,"Y",6]
[95965,"OAK GROVE",null,"Y",7]
[95965,"OREGON CITY",null,"Y",8]
[95965,"OROVILLE",null,"Y",9]
[95965,"PENTZ",null,"Y",10]
[95965,"PULGA",null,"Y",11]
[95965,"ROBINSONS CORNER",null,"Y",12]
[95965,"SOUTH OROVILLE",null,"Y",13]
[95965,"THERMALITO",null,"Y",14]
[95965,"VILLA VERONA",null,"Y",15]
[95965,"WYANDOTTE",null,"Y",16]
[95965,"YANKEE HILL",null,"Y",17]
[95966,"OROVILLE",null,"N",1]
[95967,"PARADISE",null,"N",1]
[95968,"PALERMO",null,"N",1]
[95969,"PARADISE",null,"N",1]
[95970,"CODORA",null,"Y",1]
[95970,"PRINCETON",null,"Y",2]
[95971,"BUCKS LAKE",null,"Y",1]
[95971,"EAST QUINCY",null,"Y",2]
[95971,"MASSACK",null,"Y",3]
[95971,"QUINCY",null,"Y",4]
[95971,"SPANISH RANCH",null,"Y",5]
[95971,"SPRING GARDEN",null,"Y",6]
[95972,"RACKERBY",null,"N",1]
[95973,"CHICO",null,"Y",1]
[95973,"RICHARDSON SPRINGS",null,"Y",2]
[95974,"RICHVALE",null,"N",1]
[95975,"ROUGH AND READY",null,"N",1]
[95976,"CHICO",null,"N",1]
[95977,"FRENCH CORRAL",null,"Y",1]
[95977,"SMARTVILLE",null,"Y",2]
[95978,"STIRLING CITY",null,"N",1]
[95979,"FOUTS SPRINGS",null,"Y",1]
[95979,"LODOGA",null,"Y",2]
[95979,"SITES",null,"Y",3]
[95979,"STONYFORD",null,"Y",4]
[95980,"OROVILLE",null,"Y",1]
[95980,"ROCK CREEK",null,"Y",2]
[95980,"ROCK CREST",null,"Y",3]
[95980,"ROGERS FLAT",null,"Y",4]
[95980,"STORRIE",null,"Y",5]
[95980,"TOBIN",null,"Y",6]
[95981,"LA PORTE",null,"Y",1]
[95981,"STRAWBERRY VALLEY",null,"Y",2]
[95982,"SUTTER",null,"N",1]
[95983,"GENESEE",null,"Y",1]
[95983,"TAYLORSVILLE",null,"Y",2]
[95984,"TWAIN",null,"Y",1]
[95984,"VIRGILIA",null,"Y",2]
[95986,"WASHINGTON",null,"N",1]
[95987,"LEESVILLE",null,"Y",1]
[95987,"WILBUR SPRINGS",null,"Y",2]
[95987,"WILLIAMS",null,"Y",3]
[95988,"FRUTO",null,"Y",1]
[95988,"WILLOWS",null,"Y",2]
[95991,"TIERRA BUENA",null,"Y",1]
[95991,"YUBA CITY",null,"Y",2]
[95992,"YUBA CITY",null,"N",1]
[95993,"YUBA CITY",null,"N",1]
[96001,"KESWICK",null,"Y",1]
[96001,"REDDING",null,"Y",2]
[96002,"REDDING",null,"N",1]
[96003,"REDDING",null,"N",1]
[96006,"ADIN",null,"N",1]
[96007,"ANDERSON",null,"Y",1]
[96007,"OLINDA",null,"Y",2]
[96008,"BELLA VISTA",null,"N",1]
[96009,"BIEBER",null,"N",1]
[96010,"BIG BAR",null,"N",1]
[96011,"BIG BEND",null,"N",1]
[96013,"BURNEY",null,"Y",1]
[96013,"JOHNSON PARK",null,"Y",2]
[96014,"CALLAHAN",null,"N",1]
[96015,"CANBY",null,"N",1]
[96016,"CASSEL",null,"N",1]
[96017,"CASTELLA",null,"Y",1]
[96017,"SWEET BRIER",null,"Y",2]
[96019,"CENTRAL VALLEY",null,"Y",1]
[96019,"SHASTA LAKE",null,"Y",2]
[96020,"CHESTER",null,"N",1]
[96021,"CORNING",null,"N",1]
[96022,"COTTONWOOD",null,"N",1]
[96023,"DORRIS",null,"N",1]
[96024,"DOUGLAS CITY",null,"N",1]
[96025,"DUNSMUIR",null,"N",1]
[96027,"ETNA",null,"Y",1]
[96027,"SAWYERS BAR",null,"Y",2]
[96028,"FALL RIVER MILLS",null,"N",1]
[96029,"CORNING",null,"Y",1]
[96029,"FLOURNOY",null,"Y",2]
[96031,"FORKS OF SALMON",null,"N",1]
[96032,"FORT JONES",null,"N",1]
[96033,"FRENCH GULCH",null,"N",1]
[96034,"GAZELLE",null,"N",1]
[96035,"GERBER",null,"N",1]
[96037,"GREENVIEW",null,"N",1]
[96038,"GRENADA",null,"N",1]
[96039,"HAPPY CAMP",null,"N",1]
[96040,"HAT CREEK",null,"N",1]
[96041,"HAYFORK",null,"Y",1]
[96041,"PEANUT",null,"Y",2]
[96044,"HILT",null,"Y",1]
[96044,"HORNBROOK",null,"Y",2]
[96046,"HYAMPOM",null,"N",1]
[96047,"IGO",null,"N",1]
[96048,"HELENA",null,"Y",1]
[96048,"JUNCTION CITY",null,"Y",2]
[96049,"REDDING",null,"N",1]
[96050,"HORSE CREEK",null,"Y",1]
[96050,"KLAMATH RIVER",null,"Y",2]
[96051,"LAKEHEAD",null,"N",1]
[96052,"LEWISTON",null,"N",1]
[96053,"MCARTHUR",null,"N",1]
[96054,"LOOKOUT",null,"N",1]
[96055,"LOS MOLINOS",null,"N",1]
[96056,"LITTLE VALLEY",null,"Y",1]
[96056,"MCARTHUR",null,"Y",2]
[96056,"PITTVILLE",null,"Y",3]
[96057,"MCCLOUD",null,"N",1]
[96058,"MACDOEL",null,"N",1]
[96059,"MANTON",null,"N",1]
[96061,"MILL CREEK",null,"Y",1]
[96061,"MINERAL",null,"Y",2]
[96062,"MILLVILLE",null,"N",1]
[96063,"LASSEN VOLCANIC NATIONAL PAR",null,"Y",1]
[96063,"MINERAL",null,"Y",2]
[96064,"MONTAGUE",null,"N",1]
[96065,"MONTGOMERY CREEK",null,"N",1]
[96067,"MOUNT SHASTA",null,"N",1]
[96068,"NUBIEBER",null,"N",1]
[96069,"OAK RUN",null,"N",1]
[96070,"LAKEHEAD",null,"Y",1]
[96070,"OBRIEN",null,"Y",2]
[96071,"OLD STATION",null,"N",1]
[96073,"PALO CEDRO",null,"N",1]
[96074,"PASKENTA",null,"N",1]
[96075,"PAYNES CREEK",null,"N",1]
[96076,"PLATINA",null,"Y",1]
[96076,"WILDWOOD",null,"Y",2]
[96078,"PROBERTA",null,"N",1]
[96079,"CENTRAL VALLEY",null,"Y",1]
[96079,"PROJECT CITY",null,"Y",2]
[96079,"SHASTA LAKE",null,"Y",3]
[96080,"DAIRYVILLE",null,"Y",1]
[96080,"RED BLUFF",null,"Y",2]
[96084,"ROUND MOUNTAIN",null,"N",1]
[96085,"SCOTT BAR",null,"N",1]
[96086,"SEIAD VALLEY",null,"N",1]
[96087,"SHASTA",null,"N",1]
[96088,"SHINGLETOWN",null,"Y",1]
[96088,"VIOLA",null,"Y",2]
[96089,"SHASTA LAKE",null,"Y",1]
[96089,"SUMMIT CITY",null,"Y",2]
[96090,"TEHAMA",null,"N",1]
[96091,"TRINITY CENTER",null,"N",1]
[96092,"VINA",null,"N",1]
[96093,"WEAVERVILLE",null,"N",1]
[96094,"EDGEWOOD",null,"Y",1]
[96094,"WEED",null,"Y",2]
[96095,"WHISKEYTOWN",null,"N",1]
[96096,"WHITMORE",null,"N",1]
[96097,"YREKA",null,"N",1]
[96099,"REDDING",null,"N",1]
[96101,"ALTURAS",null,"Y",1]
[96101,"ALTURAS RANCHERIA",null,"Y",2]
[96101,"CALIFORNIA PINES",null,"Y",3]
[96101,"XL RANCH INDIAN RESERVATION",null,"Y",4]
[96103,"BLAIRSDEN",null,"Y",1]
[96103,"BLAIRSDEN-GRAEAGLE",null,"Y",2]
[96103,"CROMBERG",null,"Y",3]
[96103,"GRAEAGLE",null,"Y",4]
[96103,"JOHNSVILLE",null,"Y",5]
[96104,"CEDARVILLE",null,"N",1]
[96105,"CHILCOOT",null,"N",1]
[96106,"CLIO",null,"N",1]
[96107,"COLEVILLE",null,"Y",1]
[96107,"WALKER",null,"Y",2]
[96108,"DAVIS CREEK",null,"Y",1]
[96108,"WILLOW RANCH",null,"Y",2]
[96109,"DOYLE",null,"N",1]
[96110,"EAGLEVILLE",null,"N",1]
[96111,"FLORISTON",null,"N",1]
[96112,"FORT BIDWELL",null,"Y",1]
[96112,"FT BIDWELL",null,"Y",2]
[96113,"HERLONG",null,"Y",1]
[96113,"PATTON VILLAGE",null,"Y",2]
[96113,"SIERRA ARMY DEPOT",null,"Y",3]
[96114,"JANESVILLE",null,"N",1]
[96115,"LAKE CITY",null,"N",1]
[96116,"LIKELY",null,"N",1]
[96117,"LITCHFIELD",null,"N",1]
[96118,"LOYALTON",null,"N",1]
[96119,"MADELINE",null,"N",1]
[96120,"CRYSTAL SPRINGS",null,"Y",1]
[96120,"EMIGRANT TRAIL",null,"Y",2]
[96120,"FREDRICKSBURG",null,"Y",3]
[96120,"HOPE VALLEY",null,"Y",4]
[96120,"MARKLEEVILLE",null,"Y",5]
[96120,"MESA VISTA",null,"Y",6]
[96120,"WOODFORDS",null,"Y",7]
[96121,"MILFORD",null,"N",1]
[96122,"DELLEKER",null,"Y",1]
[96122,"PORTOLA",null,"Y",2]
[96123,"RAVENDALE",null,"N",1]
[96124,"CALPINE",null,"Y",1]
[96124,"SATTLEY",null,"Y",2]
[96125,"BASSETTS",null,"Y",1]
[96125,"SIERRA CITY",null,"Y",2]
[96126,"SIERRAVILLE",null,"N",1]
[96127,"SUSANVILLE",null,"N",1]
[96128,"STANDISH",null,"N",1]
[96129,"BECKWOURTH",null,"Y",1]
[96129,"PORTOLA",null,"Y",2]
[96130,"CALIFORNIA CONSERVATION CENT",null,"Y",1]
[96130,"EAGLE LAKE RESORT",null,"Y",2]
[96130,"JOHNSTONVILLE",null,"Y",3]
[96130,"SPAULDING",null,"Y",4]
[96130,"SUSANVILLE",null,"Y",5]
[96132,"TERMO",null,"N",1]
[96133,"TOPAZ",null,"N",1]
[96134,"LAVA BEDS NATIONAL MONUMENT",null,"Y",1]
[96134,"MEDICINE LAKE LODGE",null,"Y",2]
[96134,"NEWELL",null,"Y",3]
[96134,"TIONESTA",null,"Y",4]
[96134,"TULELAKE",null,"Y",5]
[96135,"VINTON",null,"N",1]
[96136,"WENDEL",null,"N",1]
[96137,"CLEAR CREEK",null,"Y",1]
[96137,"LAKE ALMANOR",null,"Y",2]
[96137,"PENINSULA VILLAGE",null,"Y",3]
[96137,"WESTWOOD",null,"Y",4]
[96140,"AGATE BAY",null,"Y",1]
[96140,"CARNELIAN BAY",null,"Y",2]
[96140,"CEDAR FLAT",null,"Y",3]
[96140,"FLICK POINT",null,"Y",4]
[96140,"FULTON ACRES",null,"Y",5]
[96140,"RIDGEWOOD",null,"Y",6]
[96141,"HOMEWOOD",null,"Y",1]
[96141,"TAHOE PINES",null,"Y",2]
[96142,"MEEKS BAY",null,"Y",1]
[96142,"RUBICON BAY",null,"Y",2]
[96142,"TAHOMA",null,"Y",3]
[96143,"BROCKWAY",null,"Y",1]
[96143,"KINGS BEACH",null,"Y",2]
[96145,"ALPINE MEADOWS",null,"Y",1]
[96145,"TAHOE CITY",null,"Y",2]
[96146,"ALPINE MEADOWS",null,"Y",1]
[96146,"OLYMPIC VALLEY",null,"Y",2]
[96146,"TAHOE CITY",null,"Y",3]
[96148,"TAHOE VISTA",null,"N",1]
[96150,"SOUTH LAKE TAHOE",null,"N",1]
[96151,"FALLEN LEAF",null,"Y",1]
[96151,"SOUTH LAKE TAHOE",null,"Y",2]
[96152,"SOUTH LAKE TAHOE",null,"N",1]
[96154,"SOUTH LAKE TAHOE",null,"N",1]
[96155,"MEYERS",null,"Y",1]
[96155,"SOUTH LAKE TAHOE",null,"Y",2]
[96155,"TAHOE PARADISE",null,"Y",3]
[96156,"BIJOU",null,"Y",1]
[96156,"CAMP RICHARDSON",null,"Y",2]
[96156,"SOUTH LAKE TAHOE",null,"Y",3]
[96157,"SOUTH LAKE TAHOE",null,"Y",1]
[96157,"STATELINE",null,"Y",2]
[96158,"SOUTH LAKE TAHOE",null,"Y",1]
[96158,"TAHOE VALLEY",null,"Y",2]
[96160,"TRUCKEE",null,"N",1]
[96161,"BOCA",null,"Y",1]
[96161,"DONNER LAKE",null,"Y",2]
[96161,"GLENSHIRE",null,"Y",3]
[96161,"HOBART MILLS",null,"Y",4]
[96161,"NORTHSTAR",null,"Y",5]
[96161,"PROSSER LAKEVIEW",null,"Y",6]
[96161,"TAHOE DONNER",null,"Y",7]
[96161,"TRUCKEE",null,"Y",8]
[96162,"DONNER",null,"Y",1]
[96162,"TRUCKEE",null,"Y",2]
[96162,"WEST TRUCKEE",null,"Y",3]
[96701,"Aiea",null,"N",1]
[96703,"Anahola",null,"N",1]
[96704,"Captain Cook",null,"N",1]
[96705,"Eleele",null,"N",1]
[96706,"Ewa Beach",null,"N",1]
[96707,"Kapolei",null,"N",1]
[96708,"Haiku",null,"N",1]
[96709,"Kapolei",null,"N",1]
[96710,"Hakalau",null,"N",1]
[96712,"Haleiwa",null,"N",1]
[96713,"Hana",null,"N",1]
[96714,"Hanalei",null,"Y",1]
[96714,"Princeville",null,"Y",2]
[96715,"Hanamaulu",null,"N",1]
[96716,"Hanapepe",null,"N",1]
[96717,"Hauula",null,"N",1]
[96718,"Hawaii National Park",null,"N",1]
[96719,"Hawi",null,"N",1]
[96720,"Hilo",null,"N",1]
[96721,"Hilo",null,"N",1]
[96722,"Princeville",null,"N",1]
[96725,"Holualoa",null,"N",1]
[96726,"Honaunau",null,"N",1]
[96727,"Honokaa",null,"N",1]
[96728,"Honomu",null,"N",1]
[96729,"Hoolehua",null,"N",1]
[96730,"Kaaawa",null,"N",1]
[96731,"Kahuku",null,"N",1]
[96732,"Kahului",null,"N",1]
[96733,"Kahului",null,"N",1]
[96734,"Kailua",null,"N",1]
[96737,"Ocean View",null,"N",1]
[96738,"Waikoloa",null,"Y",1]
[96738,"Waikoloa Cntrct Sta",null,"Y",2]
[96739,"Kailua Kona",null,"Y",1]
[96739,"Keauhou",null,"Y",2]
[96740,"Kailua Kona",null,"N",1]
[96741,"Kalaheo",null,"N",1]
[96742,"Kalaupapa",null,"N",1]
[96743,"Kamuela",null,"N",1]
[96744,"Kaneohe",null,"N",1]
[96745,"Kailua Kona",null,"N",1]
[96746,"Kapaa",null,"N",1]
[96747,"Kaumakani",null,"N",1]
[96748,"Kaunakakai",null,"N",1]
[96749,"Keaau",null,"N",1]
[96750,"Kealakekua",null,"N",1]
[96751,"Kealia",null,"N",1]
[96752,"Kekaha",null,"N",1]
[96753,"Kihei",null,"N",1]
[96754,"Kilauea",null,"N",1]
[96755,"Kapaau",null,"N",1]
[96756,"Koloa",null,"N",1]
[96757,"Kualapuu",null,"N",1]
[96759,"Kunia",null,"N",1]
[96760,"Kurtistown",null,"N",1]
[96761,"Lahaina",null,"N",1]
[96762,"Laie",null,"N",1]
[96763,"Lanai City",null,"N",1]
[96764,"Laupahoehoe",null,"N",1]
[96765,"Lawai",null,"N",1]
[96766,"Lihue",null,"N",1]
[96767,"Lahaina",null,"N",1]
[96768,"Makawao",null,"N",1]
[96769,"Makaweli",null,"N",1]
[96770,"Maunaloa",null,"N",1]
[96771,"Mountain View",null,"N",1]
[96772,"Naalehu",null,"N",1]
[96773,"Ninole",null,"N",1]
[96774,"Ookala",null,"N",1]
[96775,"Paauhau",null,"N",1]
[96776,"Paauilo",null,"N",1]
[96777,"Pahala",null,"N",1]
[96778,"Pahoa",null,"N",1]
[96779,"Paia",null,"N",1]
[96780,"Papaaloa",null,"N",1]
[96781,"Papaikou",null,"N",1]
[96782,"Pearl City",null,"N",1]
[96783,"Pepeekeo",null,"N",1]
[96784,"Puunene",null,"N",1]
[96785,"Volcano",null,"N",1]
[96786,"Schofield",null,"Y",1]
[96786,"Schofield Barracks",null,"Y",2]
[96786,"Wahiawa",null,"Y",3]
[96788,"Pukalani",null,"N",1]
[96789,"Mililani",null,"N",1]
[96790,"Kula",null,"N",1]
[96791,"Waialua",null,"N",1]
[96792,"Waianae",null,"N",1]
[96793,"Wailuku",null,"N",1]
[96795,"Waimanalo",null,"N",1]
[96796,"Waimea",null,"N",1]
[96797,"Waipahu",null,"N",1]
[96801,"Hon",null,"Y",1]
[96801,"Hono",null,"Y",2]
[96801,"Honolulu",null,"Y",3]
[96802,"Hon",null,"Y",1]
[96802,"Hono",null,"Y",2]
[96802,"Honolulu",null,"Y",3]
[96803,"Hon",null,"Y",1]
[96803,"Hono",null,"Y",2]
[96803,"Honolulu",null,"Y",3]
[96804,"Hon",null,"Y",1]
[96804,"Hono",null,"Y",2]
[96804,"Honolulu",null,"Y",3]
[96805,"Hon",null,"Y",1]
[96805,"Hono",null,"Y",2]
[96805,"Honolulu",null,"Y",3]
[96806,"Hon",null,"Y",1]
[96806,"Hono",null,"Y",2]
[96806,"Honolulu",null,"Y",3]
[96807,"Hon",null,"Y",1]
[96807,"Hono",null,"Y",2]
[96807,"Honolulu",null,"Y",3]
[96808,"Hon",null,"Y",1]
[96808,"Hono",null,"Y",2]
[96808,"Honolulu",null,"Y",3]
[96809,"Hon",null,"Y",1]
[96809,"Hono",null,"Y",2]
[96809,"Honolulu",null,"Y",3]
[96810,"Hon",null,"Y",1]
[96810,"Hono",null,"Y",2]
[96810,"Honolulu",null,"Y",3]
[96811,"Hon",null,"Y",1]
[96811,"Hono",null,"Y",2]
[96811,"Honolulu",null,"Y",3]
[96812,"Hon",null,"Y",1]
[96812,"Hono",null,"Y",2]
[96812,"Honolulu",null,"Y",3]
[96813,"Hon",null,"Y",1]
[96813,"Hono",null,"Y",2]
[96813,"Honolulu",null,"Y",3]
[96814,"Hon",null,"Y",1]
[96814,"Hono",null,"Y",2]
[96814,"Honolulu",null,"Y",3]
[96815,"Hon",null,"Y",1]
[96815,"Hono",null,"Y",2]
[96815,"Honolulu",null,"Y",3]
[96816,"Hon",null,"Y",1]
[96816,"Hono",null,"Y",2]
[96816,"Honolulu",null,"Y",3]
[96817,"Hon",null,"Y",1]
[96817,"Hono",null,"Y",2]
[96817,"Honolulu",null,"Y",3]
[96818,"Hon",null,"Y",1]
[96818,"Hono",null,"Y",2]
[96818,"Honolulu",null,"Y",3]
[96819,"Hon",null,"Y",1]
[96819,"Hono",null,"Y",2]
[96819,"Honolulu",null,"Y",3]
[96820,"Hon",null,"Y",1]
[96820,"Hono",null,"Y",2]
[96820,"Honolulu",null,"Y",3]
[96821,"Hon",null,"Y",1]
[96821,"Hono",null,"Y",2]
[96821,"Honolulu",null,"Y",3]
[96822,"Hon",null,"Y",1]
[96822,"Hono",null,"Y",2]
[96822,"Honolulu",null,"Y",3]
[96823,"Hon",null,"Y",1]
[96823,"Hono",null,"Y",2]
[96823,"Honolulu",null,"Y",3]
[96824,"Hon",null,"Y",1]
[96824,"Hono",null,"Y",2]
[96824,"Honolulu",null,"Y",3]
[96825,"Hon",null,"Y",1]
[96825,"Hono",null,"Y",2]
[96825,"Honolulu",null,"Y",3]
[96826,"Hon",null,"Y",1]
[96826,"Hono",null,"Y",2]
[96826,"Honolulu",null,"Y",3]
[96827,"Hon",null,"Y",1]
[96827,"Hono",null,"Y",2]
[96827,"Honolulu",null,"Y",3]
[96828,"Hon",null,"Y",1]
[96828,"Hono",null,"Y",2]
[96828,"Honolulu",null,"Y",3]
[96830,"Hon",null,"Y",1]
[96830,"Hono",null,"Y",2]
[96830,"Honolulu",null,"Y",3]
[96835,"Hon",null,"Y",1]
[96835,"Hono",null,"Y",2]
[96835,"Honolulu",null,"Y",3]
[96836,"Hon",null,"Y",1]
[96836,"Hono",null,"Y",2]
[96836,"Honolulu",null,"Y",3]
[96837,"Hon",null,"Y",1]
[96837,"Hono",null,"Y",2]
[96837,"Honolulu",null,"Y",3]
[96838,"Hon",null,"Y",1]
[96838,"Hono",null,"Y",2]
[96838,"Honolulu",null,"Y",3]
[96839,"Hon",null,"Y",1]
[96839,"Hono",null,"Y",2]
[96839,"Honolulu",null,"Y",3]
[96840,"Honolulu",null,"N",1]
[96841,"Honolulu",null,"N",1]
[96842,"Honolulu",null,"N",1]
[96843,"Honolulu",null,"N",1]
[96844,"Hon",null,"Y",1]
[96844,"Hono",null,"Y",2]
[96844,"Honolulu",null,"Y",3]
[96845,"Honolulu",null,"N",1]
[96846,"Honolulu",null,"N",1]
[96847,"Honolulu",null,"N",1]
[96848,"Hon",null,"Y",1]
[96848,"Hono",null,"Y",2]
[96848,"Honolulu",null,"Y",3]
[96849,"Bancorp",null,"Y",1]
[96849,"Bancorp",null,"Y",2]
[96849,"Honolulu",null,"Y",3]
[96850,"Hon",null,"Y",1]
[96850,"Hono",null,"Y",2]
[96850,"Honolulu",null,"Y",3]
[96853,"Hickam AFB",null,"N",1]
[96854,"Wheeler Army Airfield",null,"N",1]
[96857,"Schofield Barracks",null,"N",1]
[96858,"Fort Shafter",null,"N",1]
[96859,"Tripler AMC",null,"Y",1]
[96859,"Tripler Army Medical Ctr",null,"Y",2]
[96860,"Pearl Harbor",null,"N",1]
[96861,"Camp H M Smith",null,"N",1]
[96862,"Barbers Point N A S",null,"Y",1]
[96862,"Barbers Point N A S",null,"Y",2]
[96863,"M C B H Kaneohe Bay",null,"N",1]
[96898,"Wake Island",null,"N",1]
[97001,"ANTELOPE",null,"Y",1]
[97001,"CLARNO",null,"Y",2]
[97002,"AURORA",null,"Y",1]
[97002,"BUTTEVILLE",null,"Y",2]
[97004,"BEAVERCREEK",null,"N",1]
[97005,"BEAVERTON",null,"Y",1]
[97005,"PROGRESS",null,"Y",2]
[97006,"BEAVERTON",null,"N",1]
[97007,"ALOHA",null,"Y",1]
[97007,"BEAVERTON",null,"Y",2]
[97007,"FARMINGTON MALL",null,"Y",3]
[97008,"BEAVERTON",null,"N",1]
[97009,"BORING",null,"Y",1]
[97009,"DAMASCUS",null,"Y",2]
[97010,"BRIDAL VEIL",null,"N",1]
[97011,"BRIGHTWOOD",null,"N",1]
[97013,"BARLOW",null,"Y",1]
[97013,"CANBY",null,"Y",2]
[97014,"BONNEVILLE",null,"Y",1]
[97014,"CASCADE LOCKS",null,"Y",2]
[97014,"DODSON",null,"Y",3]
[97014,"WYETH",null,"Y",4]
[97015,"CARVER",null,"Y",1]
[97015,"CLACKAMAS",null,"Y",2]
[97015,"HAPPY VALLEY",null,"Y",3]
[97016,"BIRKENFELD",null,"Y",1]
[97016,"CLATSKANIE",null,"Y",2]
[97016,"MIST",null,"Y",3]
[97016,"WESTPORT",null,"Y",4]
[97017,"COLTON",null,"N",1]
[97018,"COLUMBIA CITY",null,"N",1]
[97019,"CORBETT",null,"N",1]
[97020,"DONALD",null,"N",1]
[97021,"DUFUR",null,"Y",1]
[97021,"FRIEND",null,"Y",2]
[97022,"DOVER",null,"Y",1]
[97022,"EAGLE CREEK",null,"Y",2]
[97023,"ESTACADA",null,"N",1]
[97024,"FAIRVIEW",null,"Y",1]
[97024,"INTERLACHEN",null,"Y",2]
[97026,"GERVAIS",null,"Y",1]
[97026,"SAINT LOUIS",null,"Y",2]
[97027,"GLADSTONE",null,"N",1]
[97028,"GOVERNMENT CAMP",null,"Y",1]
[97028,"TIMBERLINE LODGE",null,"Y",2]
[97029,"GRASS VALLEY",null,"N",1]
[97030,"GRESHAM",null,"N",1]
[97031,"DEE",null,"Y",1]
[97031,"HOOD RIVER",null,"Y",2]
[97032,"HUBBARD",null,"N",1]
[97033,"KENT",null,"N",1]
[97034,"LAKE GROVE",null,"Y",1]
[97034,"LAKE OSWEGO",null,"Y",2]
[97034,"OSWEGO",null,"Y",3]
[97035,"LAKE GROVE",null,"Y",1]
[97035,"LAKE OSWEGO",null,"Y",2]
[97035,"MOUNTAIN PARK",null,"Y",3]
[97036,"MARYLHURST",null,"N",1]
[97037,"MAUPIN",null,"Y",1]
[97037,"PINE GROVE",null,"Y",2]
[97038,"LIBERAL",null,"Y",1]
[97038,"MOLALLA",null,"Y",2]
[97039,"MORO",null,"N",1]
[97040,"MOSIER",null,"N",1]
[97041,"MOUNT HOOD",null,"Y",1]
[97041,"MOUNT HOOD PARKDALE",null,"Y",2]
[97041,"MT HOOD",null,"Y",3]
[97041,"MT HOOD PRKDL",null,"Y",4]
[97041,"PARKDALE",null,"Y",5]
[97042,"MULINO",null,"N",1]
[97044,"ODELL",null,"N",1]
[97045,"OREGON CITY",null,"Y",1]
[97045,"REDLAND",null,"Y",2]
[97048,"RAINIER",null,"N",1]
[97049,"RHODODENDRON",null,"Y",1]
[97049,"ZIGZAG",null,"Y",2]
[97050,"RUFUS",null,"N",1]
[97051,"SAINT HELENS",null,"Y",1]
[97051,"ST HELENS",null,"Y",2]
[97053,"WARREN",null,"N",1]
[97054,"DEER ISLAND",null,"N",1]
[97055,"SANDY",null,"N",1]
[97056,"SCAPPOOSE",null,"N",1]
[97057,"SHANIKO",null,"N",1]
[97058,"CELILO",null,"Y",1]
[97058,"ROWENA",null,"Y",2]
[97058,"THE DALLES",null,"Y",3]
[97060,"SPRINGDALE",null,"Y",1]
[97060,"TROUTDALE",null,"Y",2]
[97060,"WOOD VILLAGE",null,"Y",3]
[97062,"TUALATIN",null,"N",1]
[97063,"TYGH VALLEY",null,"Y",1]
[97063,"WAMIC",null,"Y",2]
[97064,"VERNONIA",null,"N",1]
[97065,"BIGGS",null,"Y",1]
[97065,"BIGGS JUNCTION",null,"Y",2]
[97065,"WASCO",null,"Y",3]
[97067,"WELCHES",null,"Y",1]
[97067,"WEMME",null,"Y",2]
[97068,"WANKERS CORNERS",null,"Y",1]
[97068,"WEST LINN",null,"Y",2]
[97068,"WILLAMETTE",null,"Y",3]
[97070,"CHARBONNEAU",null,"Y",1]
[97070,"WILSONVILLE",null,"Y",2]
[97071,"MONITOR",null,"Y",1]
[97071,"WOODBURN",null,"Y",2]
[97075,"BEAVERTON",null,"N",1]
[97076,"BEAVERTON",null,"N",1]
[97077,"BEAVERTON",null,"N",1]
[97078,"BEAVERTON",null,"N",1]
[97080,"GRESHAM",null,"N",1]
[97101,"AMITY",null,"N",1]
[97102,"ARCH CAPE",null,"N",1]
[97103,"ASTORIA",null,"Y",1]
[97103,"TONGUE POINT",null,"Y",2]
[97106,"BANKS",null,"N",1]
[97107,"BAY CITY",null,"N",1]
[97108,"BEAVER",null,"N",1]
[97109,"BANKS",null,"Y",1]
[97109,"BUXTON",null,"Y",2]
[97110,"CANNON BEACH",null,"N",1]
[97111,"CARLTON",null,"N",1]
[97112,"CLOVERDALE",null,"N",1]
[97113,"CORNELIUS",null,"N",1]
[97114,"DAYTON",null,"Y",1]
[97114,"GRAND ISLAND",null,"Y",2]
[97115,"DUNDEE",null,"N",1]
[97116,"FOREST GROVE",null,"Y",1]
[97116,"GLENWOOD",null,"Y",2]
[97116,"VERBOORT",null,"Y",3]
[97117,"GALES CREEK",null,"N",1]
[97118,"GARIBALDI",null,"N",1]
[97119,"GASTON",null,"N",1]
[97121,"FORT STEVENS",null,"Y",1]
[97121,"HAMMOND",null,"Y",2]
[97122,"HEBO",null,"N",1]
[97123,"HILLSBORO",null,"Y",1]
[97123,"ORENCO",null,"Y",2]
[97123,"SCHOLLS",null,"Y",3]
[97124,"HELVETIA",null,"Y",1]
[97124,"HILLSBORO",null,"Y",2]
[97124,"ORENCO",null,"Y",3]
[97124,"WEST UNION",null,"Y",4]
[97125,"BANKS",null,"Y",1]
[97125,"MANNING",null,"Y",2]
[97127,"LAFAYETTE",null,"N",1]
[97128,"MCMINNVILLE",null,"N",1]
[97130,"MANZANITA",null,"N",1]
[97131,"MOHLER",null,"Y",1]
[97131,"NEAHKAHNIE",null,"Y",2]
[97131,"NEHALEM",null,"Y",3]
[97132,"NEWBERG",null,"N",1]
[97133,"NORTH PLAINS",null,"N",1]
[97134,"OCEANSIDE",null,"N",1]
[97135,"PACIFIC CITY",null,"N",1]
[97136,"BRIGHTON",null,"Y",1]
[97136,"MANHATTAN BEACH",null,"Y",2]
[97136,"ROCKAWAY",null,"Y",3]
[97136,"ROCKAWAY BEACH",null,"Y",4]
[97136,"TWIN ROCKS",null,"Y",5]
[97137,"SAINT PAUL",null,"Y",1]
[97137,"ST PAUL",null,"Y",2]
[97138,"ELSIE",null,"Y",1]
[97138,"GEARHART",null,"Y",2]
[97138,"JEWELL",null,"Y",3]
[97138,"SEASIDE",null,"Y",4]
[97140,"SHERWOOD",null,"N",1]
[97141,"CAPE MEARES",null,"Y",1]
[97141,"LEES CAMP",null,"Y",2]
[97141,"TILLAMOOK",null,"Y",3]
[97143,"NETARTS",null,"N",1]
[97144,"TIMBER",null,"N",1]
[97145,"TOLOVANA PARK",null,"N",1]
[97146,"CAMP RILEA",null,"Y",1]
[97146,"SURF PINES",null,"Y",2]
[97146,"WARRENTON",null,"Y",3]
[97147,"WHEELER",null,"N",1]
[97148,"YAMHILL",null,"N",1]
[97149,"NESKOWIN",null,"N",1]
[97201,"PORTLAND",null,"N",1]
[97202,"PORTLAND",null,"N",1]
[97203,"PORTLAND",null,"N",1]
[97204,"PORTLAND",null,"N",1]
[97205,"PORTLAND",null,"N",1]
[97206,"PORTLAND",null,"N",1]
[97207,"PORTLAND",null,"N",1]
[97208,"PORTLAND",null,"N",1]
[97209,"PORTLAND",null,"N",1]
[97210,"PORTLAND",null,"N",1]
[97211,"PORTLAND",null,"N",1]
[97212,"PORTLAND",null,"N",1]
[97213,"PORTLAND",null,"N",1]
[97214,"PORTLAND",null,"N",1]
[97215,"PORTLAND",null,"N",1]
[97216,"PORTLAND",null,"N",1]
[97217,"PORTLAND",null,"N",1]
[97218,"PORTLAND",null,"N",1]
[97219,"MULTNOMAH",null,"Y",1]
[97219,"PORTLAND",null,"Y",2]
[97220,"MAYWOOD PARK",null,"Y",1]
[97220,"MAYWOOD PK",null,"Y",2]
[97220,"PARKROSE",null,"Y",3]
[97220,"PORTLAND",null,"Y",4]
[97221,"PORTLAND",null,"N",1]
[97222,"MILWAUKIE",null,"Y",1]
[97222,"OAK GROVE",null,"Y",2]
[97222,"PORTLAND",null,"Y",3]
[97223,"GARDEN HOME CONT BR",null,"Y",1]
[97223,"GREENWAY CONT BR",null,"Y",2]
[97223,"PORTLAND",null,"Y",3]
[97223,"TIGARD",null,"Y",4]
[97224,"DURHAM",null,"Y",1]
[97224,"KING CITY",null,"Y",2]
[97224,"PORTLAND",null,"Y",3]
[97224,"TIGARD",null,"Y",4]
[97225,"PORTLAND",null,"Y",1]
[97225,"WEST SLOPE",null,"Y",2]
[97227,"PORTLAND",null,"N",1]
[97228,"PORTLAND",null,"N",1]
[97229,"CEDAR MILL",null,"Y",1]
[97229,"FOREST HEIGHTS",null,"Y",2]
[97229,"PORTLAND",null,"Y",3]
[97229,"ROCK CREEK",null,"Y",4]
[97230,"PARKROSE",null,"Y",1]
[97230,"PORTLAND",null,"Y",2]
[97231,"BURLINGTON",null,"Y",1]
[97231,"PORTLAND",null,"Y",2]
[97232,"PORTLAND",null,"N",1]
[97233,"PORTLAND",null,"Y",1]
[97233,"ROCKWOOD",null,"Y",2]
[97236,"HAPPY VALLEY",null,"Y",1]
[97236,"PORTLAND",null,"Y",2]
[97238,"PORTLAND",null,"N",1]
[97240,"PORTLAND",null,"N",1]
[97242,"PORTLAND",null,"N",1]
[97251,"PORTLAND",null,"Y",1]
[97251,"US WEST COMMUNICATIONS",null,"Y",2]
[97253,"PORTLAND",null,"N",1]
[97254,"PORTLAND",null,"Y",1]
[97254,"PORTLAND GENERAL",null,"Y",2]
[97255,"NW NATURAL GAS",null,"Y",1]
[97255,"PORTLAND",null,"Y",2]
[97256,"PACIFICORP",null,"Y",1]
[97256,"PORTLAND",null,"Y",2]
[97258,"PORTLAND",null,"N",1]
[97259,"PORTLAND",null,"N",1]
[97266,"HAPPY VALLEY",null,"Y",1]
[97266,"PORTLAND",null,"Y",2]
[97267,"JENNINGS LODGE",null,"Y",1]
[97267,"JOHNSON CITY",null,"Y",2]
[97267,"MILWAUKIE",null,"Y",3]
[97267,"OAK GROVE",null,"Y",4]
[97267,"OAK LODGE",null,"Y",5]
[97267,"PORTLAND",null,"Y",6]
[97268,"OAK GROVE",null,"Y",1]
[97268,"PORTLAND",null,"Y",2]
[97269,"MILWAUKIE",null,"Y",1]
[97269,"PORTLAND",null,"Y",2]
[97271,"PORTLAND",null,"N",1]
[97272,"PORTLAND",null,"N",1]
[97280,"PORTLAND",null,"N",1]
[97281,"PORTLAND",null,"Y",1]
[97281,"TIGARD",null,"Y",2]
[97282,"PORTLAND",null,"N",1]
[97283,"PORTLAND",null,"N",1]
[97286,"PORTLAND",null,"N",1]
[97290,"PORTLAND",null,"N",1]
[97291,"CEDAR MILL",null,"Y",1]
[97291,"PORTLAND",null,"Y",2]
[97292,"PORTLAND",null,"N",1]
[97293,"PORTLAND",null,"N",1]
[97294,"PORTLAND",null,"N",1]
[97296,"PORTLAND",null,"N",1]
[97298,"PORTLAND",null,"N",1]
[97299,"PORTLAND",null,"N",1]
[97301,"SALEM",null,"N",1]
[97302,"SALEM",null,"N",1]
[97303,"KEIZER",null,"Y",1]
[97303,"SALEM",null,"Y",2]
[97304,"SALEM",null,"Y",1]
[97304,"WEST SALEM",null,"Y",2]
[97305,"BROOKS",null,"Y",1]
[97305,"OAK PARK",null,"Y",2]
[97305,"SALEM",null,"Y",3]
[97306,"SALEM",null,"N",1]
[97307,"KEIZER",null,"Y",1]
[97307,"SALEM",null,"Y",2]
[97308,"SALEM",null,"N",1]
[97309,"SALEM",null,"N",1]
[97310,"SALEM",null,"N",1]
[97311,"SALEM",null,"N",1]
[97312,"SALEM",null,"N",1]
[97313,"SALEM",null,"N",1]
[97314,"SALEM",null,"N",1]
[97321,"ALBANY",null,"N",1]
[97324,"ALSEA",null,"N",1]
[97325,"AUMSVILLE",null,"Y",1]
[97325,"N SANTIAM",null,"Y",2]
[97326,"BLODGETT",null,"N",1]
[97327,"BROWNSVILLE",null,"N",1]
[97329,"CASCADIA",null,"N",1]
[97330,"CORVALLIS",null,"N",1]
[97331,"CORVALLIS",null,"Y",1]
[97331,"OREGON STATE UNIV",null,"Y",2]
[97333,"CORVALLIS",null,"N",1]
[97335,"CRABTREE",null,"N",1]
[97336,"CRAWFORDSVILLE",null,"N",1]
[97338,"DALLAS",null,"N",1]
[97339,"CORVALLIS",null,"N",1]
[97341,"DEPOE BAY",null,"N",1]
[97342,"DETROIT",null,"N",1]
[97343,"EDDYVILLE",null,"N",1]
[97344,"FALLS CITY",null,"N",1]
[97345,"FOSTER",null,"N",1]
[97346,"GATES",null,"N",1]
[97347,"GRAND RONDE",null,"N",1]
[97348,"HALSEY",null,"N",1]
[97350,"IDANHA",null,"N",1]
[97351,"INDEPENDENCE",null,"N",1]
[97352,"JEFFERSON",null,"N",1]
[97355,"LEBANON",null,"N",1]
[97357,"LOGSDEN",null,"N",1]
[97358,"LYONS",null,"N",1]
[97359,"MARION",null,"Y",1]
[97359,"TURNER",null,"Y",2]
[97360,"MILL CITY",null,"N",1]
[97361,"MONMOUTH",null,"N",1]
[97362,"MOUNT ANGEL",null,"N",1]
[97364,"NEOTSU",null,"N",1]
[97365,"AGATE BEACH",null,"Y",1]
[97365,"NEWPORT",null,"Y",2]
[97365,"OTTER CREST",null,"Y",3]
[97366,"NEWPORT",null,"Y",1]
[97366,"SOUTH BEACH",null,"Y",2]
[97367,"KERNVILLE",null,"Y",1]
[97367,"LINCOLN CITY",null,"Y",2]
[97368,"OTIS",null,"N",1]
[97369,"OTTER ROCK",null,"N",1]
[97370,"PHILOMATH",null,"N",1]
[97371,"RICKREALL",null,"N",1]
[97372,"ROSE LODGE",null,"N",1]
[97373,"SAINT BENEDICT",null,"N",1]
[97374,"SCIO",null,"N",1]
[97375,"SCOTTS MILLS",null,"N",1]
[97376,"SEAL ROCK",null,"N",1]
[97377,"SHEDD",null,"N",1]
[97378,"SHERIDAN",null,"N",1]
[97380,"SILETZ",null,"N",1]
[97381,"SILVERTON",null,"N",1]
[97383,"STAYTON",null,"N",1]
[97384,"MEHAMA",null,"N",1]
[97385,"SUBLIMITY",null,"N",1]
[97386,"SWEET HOME",null,"N",1]
[97388,"GLENEDEN BEACH",null,"N",1]
[97389,"TANGENT",null,"N",1]
[97390,"TIDEWATER",null,"N",1]
[97391,"TOLEDO",null,"N",1]
[97392,"TURNER",null,"N",1]
[97394,"WALDPORT",null,"N",1]
[97396,"WILLAMINA",null,"N",1]
[97401,"COLLEGE CREST",null,"Y",1]
[97401,"COUNTRY CLUB PLAZA",null,"Y",2]
[97401,"CROW",null,"Y",3]
[97401,"EU",null,"Y",4]
[97401,"EUGENE",null,"Y",5]
[97401,"FIR GROVE",null,"Y",6]
[97401,"IRVING",null,"Y",7]
[97401,"UNIVERSITY",null,"Y",8]
[97401,"VALLEY RIVER CENTER",null,"Y",9]
[97402,"ACORN PARK",null,"Y",1]
[97402,"EUGENE",null,"Y",2]
[97402,"WEST SIDE",null,"Y",3]
[97403,"EUGENE",null,"Y",1]
[97403,"UNIVERSITY",null,"Y",2]
[97404,"EUGENE",null,"Y",1]
[97404,"SANTA CLARA",null,"Y",2]
[97405,"EUGENE",null,"Y",1]
[97405,"PLEASANT HILL",null,"Y",2]
[97406,"AGNESS",null,"N",1]
[97407,"ALLEGANY",null,"N",1]
[97408,"COBURG",null,"Y",1]
[97408,"EUGENE",null,"Y",2]
[97408,"RIVER ROAD",null,"Y",3]
[97409,"ALVADORE",null,"N",1]
[97410,"AZALEA",null,"N",1]
[97411,"BANDON",null,"N",1]
[97412,"BLACHLY",null,"Y",1]
[97412,"EUGENE",null,"Y",2]
[97412,"TRIANGLE LAKE",null,"Y",3]
[97413,"BLUE RIVER",null,"Y",1]
[97413,"MC KENZIE BRIDGE",null,"Y",2]
[97414,"BROADBENT",null,"N",1]
[97415,"BROOKINGS",null,"Y",1]
[97415,"HARBOR",null,"Y",2]
[97416,"CAMAS VALLEY",null,"N",1]
[97417,"CANYONVILLE",null,"N",1]
[97419,"CHESHIRE",null,"N",1]
[97420,"CHARLESTON",null,"Y",1]
[97420,"COOS BAY",null,"Y",2]
[97420,"COOS HEAD NAVAL FACILITY",null,"Y",3]
[97420,"EASTSIDE CPO COOS BAY",null,"Y",4]
[97423,"COQUILLE",null,"N",1]
[97424,"COTTAGE GROVE",null,"Y",1]
[97424,"WALDEN",null,"Y",2]
[97425,"CASCADE SUMMIT",null,"Y",1]
[97425,"CRESCENT LAKE",null,"Y",2]
[97426,"CRESWELL",null,"Y",1]
[97426,"WALKER",null,"Y",2]
[97427,"CULP CREEK",null,"N",1]
[97428,"CURTIN",null,"N",1]
[97429,"DAYS CREEK",null,"N",1]
[97430,"DEADWOOD",null,"Y",1]
[97430,"GREENLEAF",null,"Y",2]
[97431,"DEXTER",null,"N",1]
[97432,"DILLARD",null,"N",1]
[97434,"DORENA",null,"N",1]
[97435,"DRAIN",null,"N",1]
[97436,"ELKTON",null,"N",1]
[97437,"ELMIRA",null,"N",1]
[97438,"FALL CREEK",null,"Y",1]
[97438,"JASPER",null,"Y",2]
[97439,"FLORENCE",null,"N",1]
[97440,"EUGENE",null,"N",1]
[97441,"GARDINER",null,"N",1]
[97442,"GLENDALE",null,"N",1]
[97443,"GLIDE",null,"N",1]
[97444,"GOLD BEACH",null,"Y",1]
[97444,"PISTOL RIVER",null,"Y",2]
[97446,"HARRISBURG",null,"N",1]
[97447,"IDLEYLD PARK",null,"N",1]
[97448,"JUNCTION CITY",null,"N",1]
[97449,"LAKESIDE",null,"N",1]
[97450,"LANGLOIS",null,"N",1]
[97451,"LORANE",null,"Y",1]
[97451,"ROGUE ELK",null,"Y",2]
[97452,"LOWELL",null,"N",1]
[97453,"MAPLETON",null,"N",1]
[97454,"MARCOLA",null,"N",1]
[97455,"EUGENE",null,"Y",1]
[97455,"PLEASANT HILL",null,"Y",2]
[97456,"ALPINE",null,"Y",1]
[97456,"MONROE",null,"Y",2]
[97457,"MYRTLE CREEK",null,"N",1]
[97458,"MYRTLE POINT",null,"Y",1]
[97458,"NORWAY",null,"Y",2]
[97458,"REMOTE",null,"Y",3]
[97459,"NORTH BEND",null,"N",1]
[97460,"NORWAY",null,"N",1]
[97461,"NOTI",null,"N",1]
[97462,"OAKLAND",null,"N",1]
[97463,"OAKRIDGE",null,"N",1]
[97464,"OPHIR",null,"N",1]
[97465,"PORT ORFORD",null,"N",1]
[97466,"POWERS",null,"N",1]
[97467,"REEDSPORT",null,"Y",1]
[97467,"WINCHESTER BAY",null,"Y",2]
[97468,"REMOTE",null,"N",1]
[97469,"RIDDLE",null,"N",1]
[97470,"ROSEBURG",null,"N",1]
[97472,"COTTAGE GROVE",null,"Y",1]
[97472,"SAGINAW",null,"Y",2]
[97473,"GREENACRES",null,"Y",1]
[97473,"MURPHYS CAMP",null,"Y",2]
[97473,"SCOTTSBURG",null,"Y",3]
[97476,"SIXES",null,"N",1]
[97477,"SPRINGFIELD",null,"N",1]
[97478,"SPRINGFIELD",null,"N",1]
[97479,"SUTHERLIN",null,"N",1]
[97480,"SWISSHOME",null,"N",1]
[97481,"TENMILE",null,"N",1]
[97482,"SPRINGFIELD",null,"Y",1]
[97482,"THURSTON",null,"Y",2]
[97484,"TILLER",null,"N",1]
[97486,"UMPQUA",null,"N",1]
[97487,"VAUGHN",null,"Y",1]
[97487,"VENETA",null,"Y",2]
[97488,"VIDA",null,"N",1]
[97489,"LEABURG",null,"Y",1]
[97489,"WALTERVILLE",null,"Y",2]
[97490,"WALTON",null,"N",1]
[97491,"WEDDERBURN",null,"N",1]
[97492,"WESTFIR",null,"N",1]
[97493,"WESTLAKE",null,"N",1]
[97494,"WILBUR",null,"N",1]
[97495,"WINCHESTER",null,"N",1]
[97496,"WINSTON",null,"N",1]
[97497,"WOLF CREEK",null,"N",1]
[97498,"YACHATS",null,"N",1]
[97499,"YONCALLA",null,"N",1]
[97501,"MEDFORD",null,"N",1]
[97502,"CENTRAL POINT",null,"Y",1]
[97502,"MEDFORD",null,"Y",2]
[97503,"MEDFORD",null,"Y",1]
[97503,"WHITE CITY",null,"Y",2]
[97504,"MEDFORD",null,"N",1]
[97520,"ASHLAND",null,"N",1]
[97522,"BUTTE FALLS",null,"N",1]
[97523,"CAVE JUNCTION",null,"Y",1]
[97523,"KERBY",null,"Y",2]
[97524,"EAGLE POINT",null,"N",1]
[97525,"GOLD HILL",null,"N",1]
[97526,"GRANTS PASS",null,"Y",1]
[97526,"HUGO",null,"Y",2]
[97527,"GRANTS PASS",null,"N",1]
[97528,"GRANTS PASS",null,"N",1]
[97530,"APPLEGATE",null,"Y",1]
[97530,"JACKSONVILLE",null,"Y",2]
[97531,"CAVE JUNCTION",null,"Y",1]
[97531,"KERBY",null,"Y",2]
[97532,"GALICE",null,"Y",1]
[97532,"MERLIN",null,"Y",2]
[97533,"MURPHY",null,"N",1]
[97534,"O BRIEN",null,"N",1]
[97535,"PHOENIX",null,"N",1]
[97536,"PROSPECT",null,"N",1]
[97537,"ROGUE RIVER",null,"N",1]
[97538,"SELMA",null,"N",1]
[97539,"SHADY COVE",null,"N",1]
[97540,"TALENT",null,"N",1]
[97541,"TRAIL",null,"N",1]
[97543,"GRANTS PASS",null,"Y",1]
[97543,"WILDERVILLE",null,"Y",2]
[97544,"WILLIAMS",null,"N",1]
[97601,"KINGSLEY FIELD",null,"Y",2]
[97601,"KLAMATH",null,"Y",3]
[97601,"KLAMATH FALLS",null,"Y",3]
[97601,"ORETECH",null,"Y",4]
[97601,"WORDEN",null,"Y",6]
[97602,"KLAMATH FALLS",null,"N",1]
[97603,"KLAMATH FALLS",null,"N",1]
[97604,"CHILOQUIN",null,"N",1]
[97604,"CRATER LAKE",null,"N",1]
[97620,"ADEL",null,"N",1]
[97621,"BEATTY",null,"N",1]
[97622,"BLY",null,"N",1]
[97623,"BONANZA",null,"N",1]
[97624,"CHILOQUIN",null,"N",1]
[97625,"DAIRY",null,"Y",1]
[97625,"KLAMATH FALLS",null,"Y",2]
[97626,"FORT KLAMATH",null,"N",1]
[97627,"KENO",null,"N",1]
[97630,"LAKEVIEW",null,"N",1]
[97632,"MALIN",null,"N",1]
[97633,"MERRILL",null,"N",1]
[97634,"MIDLAND",null,"N",1]
[97635,"NEW PINE CREEK",null,"N",1]
[97636,"PAISLEY",null,"N",1]
[97637,"PLUSH",null,"N",1]
[97638,"SILVER LAKE",null,"N",1]
[97639,"CHILOQUIN",null,"Y",1]
[97639,"SPRAGUE RIVER",null,"Y",2]
[97640,"SUMMER LAKE",null,"N",1]
[97641,"CHRISTMAS VALLEY",null,"N",1]
[97701,"BEND",null,"N",1]
[97702,"BEND",null,"N",1]
[97707,"BEND",null,"Y",1]
[97707,"SUNRIVER",null,"Y",2]
[97708,"BEND",null,"N",1]
[97709,"BEND",null,"N",1]
[97710,"FIELDS",null,"Y",2]
[97711,"ASHWOOD",null,"N",1]
[97712,"BROTHERS",null,"N",1]
[97720,"BURNS",null,"Y",1]
[97721,"PRINCETON",null,"N",1]
[97722,"BURNS",null,"N",1]
[97722,"DIAMOND",null,"N",1]
[97730,"CAMP SHERMAN",null,"N",1]
[97731,"CHEMULT",null,"Y",1]
[97731,"DIAMOND LAKE",null,"Y",2]
[97732,"CRANE",null,"N",1]
[97733,"CRESCENT",null,"Y",1]
[97734,"CULVER",null,"N",1]
[97735,"FORT ROCK",null,"N",1]
[97736,"FRENCHGLEN",null,"N",1]
[97737,"GILCHRIST",null,"N",1]
[97738,"HINES",null,"N",1]
[97739,"LA PINE",null,"Y",2]
[97740,"LAWEN",null,"N",1]
[97741,"MADRAS",null,"Y",1]
[97741,"METOLIUS",null,"Y",2]
[97750,"MITCHELL",null,"N",1]
[97751,"PAULINA",null,"N",1]
[97752,"POST",null,"N",1]
[97753,"POWELL BUTTE",null,"N",1]
[97754,"PRINEVILLE",null,"N",1]
[97756,"EAGLE CREST",null,"Y",1]
[97756,"REDMOND",null,"Y",2]
[97758,"RILEY",null,"N",1]
[97759,"BLACK BUTTE RANCH",null,"Y",1]
[97759,"SISTERS",null,"Y",2]
[97760,"CRKD RVR RNCH",null,"Y",1]
[97760,"CROOKED RIVER",null,"Y",2]
[97760,"CROOKED RIVER RANCH",null,"Y",3]
[97760,"CROOKED RIVER RANCH CPU",null,"Y",4]
[97760,"TERREBONNE",null,"Y",5]
[97761,"KAHNEETA",null,"Y",1]
[97761,"WARM SPRINGS",null,"Y",2]
[97801,"PENDLETON",null,"Y",2]
[97810,"ADAMS",null,"N",1]
[97812,"ARLINGTON",null,"N",1]
[97813,"ATHENA",null,"N",1]
[97814,"BAKER",null,"Y",1]
[97814,"BAKER CITY",null,"Y",2]
[97814,"KEATING",null,"Y",3]
[97814,"MEDICAL SPRINGS",null,"Y",4]
[97817,"BATES",null,"N",1]
[97818,"BOARDMAN",null,"N",1]
[97819,"BRIDGEPORT",null,"N",1]
[97820,"CANYON CITY",null,"N",1]
[97821,"CAYUSE",null,"N",1]
[97823,"CONDON",null,"N",1]
[97824,"COVE",null,"N",1]
[97825,"DAYVILLE",null,"N",1]
[97826,"ECHO",null,"N",1]
[97827,"ELGIN",null,"N",1]
[97828,"ENTERPRISE",null,"N",1]
[97830,"FOSSIL",null,"Y",1]
[97830,"KINZUA",null,"Y",2]
[97830,"MAYVILLE",null,"Y",3]
[97831,"FOX",null,"N",1]
[97833,"HAINES",null,"N",1]
[97834,"HALFWAY",null,"N",1]
[97835,"HELIX",null,"N",1]
[97836,"HEPPNER",null,"N",1]
[97837,"HEREFORD",null,"N",1]
[97838,"HERMISTON",null,"N",1]
[97839,"LEXINGTON",null,"Y",1]
[97840,"OXBOW",null,"N",1]
[97841,"IMBLER",null,"N",1]
[97842,"IMNAHA",null,"N",1]
[97843,"IONE",null,"N",1]
[97844,"IRRIGON",null,"N",1]
[97845,"JOHN DAY",null,"N",1]
[97846,"JOSEPH",null,"N",1]
[97848,"KIMBERLY",null,"N",1]
[97850,"ISLAND CITY",null,"Y",1]
[97850,"LA GRANDE",null,"Y",2]
[97856,"LONG CREEK",null,"N",1]
[97857,"LOSTINE",null,"N",1]
[97859,"MEACHAM",null,"Y",1]
[97861,"ARLINGTON",null,"Y",1]
[97861,"MIKKALO",null,"Y",2]
[97862,"MILTON FREEWATER",null,"Y",1]
[97862,"MILTON FRWTR",null,"Y",2]
[97864,"MONUMENT",null,"N",1]
[97865,"MOUNT VERNON",null,"N",1]
[97865,"MT VERNON",null,"N",1]
[97867,"N POWDER",null,"N",1]
[97867,"NORTH POWDER",null,"N",1]
[97868,"PILOT ROCK",null,"N",1]
[97869,"PRAIRIE CITY",null,"N",1]
[97870,"RICHLAND",null,"N",1]
[97872,"RITTER",null,"N",1]
[97873,"SENECA",null,"N",1]
[97874,"SPRAY",null,"N",1]
[97875,"STANFIELD",null,"N",1]
[97876,"SUMMERVILLE",null,"N",1]
[97877,"GRANITE",null,"Y",1]
[97877,"SUMPTER",null,"Y",2]
[97880,"DALE",null,"Y",1]
[97880,"UKIAH",null,"Y",3]
[97882,"MCNARY",null,"Y",1]
[97882,"UMATILLA",null,"Y",2]
[97883,"UNION",null,"N",1]
[97884,"UNITY",null,"N",1]
[97885,"WALLOWA",null,"N",1]
[97886,"WESTON",null,"N",1]
[97901,"ADRIAN",null,"N",1]
[97902,"AROCK",null,"N",1]
[97903,"BROGAN",null,"Y",1]
[97904,"DREWSEY",null,"N",1]
[97905,"DURKEE",null,"Y",1]
[97905,"WEATHERBY",null,"Y",2]
[97906,"HARPER",null,"N",1]
[97907,"HUNTINGTON",null,"Y",1]
[97907,"LIME",null,"Y",2]
[97907,"RYE VALLEY",null,"Y",3]
[97908,"IRONSIDE",null,"Y",1]
[97909,"JAMIESON",null,"N",1]
[97910,"BURNS JUNCTION",null,"Y",1]
[97910,"DANNER",null,"Y",2]
[97910,"JORDAN VALLEY",null,"Y",3]
[97910,"ROME",null,"Y",4]
[97911,"BEULAH",null,"Y",1]
[97911,"JONESBORO",null,"Y",2]
[97911,"JUNTURA",null,"Y",3]
[97913,"ARCADIA",null,"Y",1]
[97913,"NYSSA",null,"Y",2]
[97913,"OWYHEE CORNERS",null,"Y",3]
[97914,"CAIRO",null,"Y",1]
[97914,"CLAUDE",null,"Y",2]
[97914,"ONTARIO",null,"Y",3]
[97917,"RIVERSIDE",null,"N",1]
[97918,"VALE",null,"Y",1]
[97918,"WILLOWCREEK",null,"Y",2]
[97920,"WESTFALL",null,"N",1]
[98001,"ALGONA",null,"Y",1]
[98001,"AUBURN",null,"Y",2]
[98001,"FEDERAL WAY",null,"Y",3]
[98002,"AUBURN",null,"N",1]
[98003,"AUBURN",null,"Y",1]
[98003,"FEDERAL WAY",null,"Y",2]
[98004,"BEAUX ARTS",null,"Y",1]
[98004,"BELLEVUE",null,"Y",3]
[98004,"CLYDE HILL",null,"Y",4]
[98004,"HUNTS POINT",null,"Y",5]
[98004,"YARROW POINT",null,"Y",6]
[98005,"BELLEVUE",null,"N",1]
[98006,"BELLEVUE",null,"Y",1]
[98006,"EASTGATE",null,"Y",2]
[98006,"NEWPORT HILLS",null,"Y",4]
[98007,"BELLEVUE",null,"Y",1]
[98007,"EASTGATE",null,"Y",2]
[98007,"LAKE HILLS",null,"Y",2]
[98008,"BELLEVUE",null,"N",1]
[98009,"BELLEVUE",null,"N",1]
[98010,"BLACK DIAMOND",null,"Y",1]
[98010,"MORGANVILLE",null,"Y",2]
[98011,"BOTHELL",null,"Y",1]
[98011,"INGLEWOOD",null,"Y",2]
[98011,"KENMORE",null,"Y",3]
[98011,"QUEENSGATE",null,"Y",3]
[98012,"BOTHELL",null,"Y",1]
[98012,"MILL CREEK",null,"Y",2]
[98013,"BURTON",null,"Y",1]
[98013,"VASHON",null,"Y",2]
[98014,"CARNATION",null,"Y",1]
[98014,"LAKE JOY",null,"Y",2]
[98015,"BELLEVUE",null,"N",1]
[98019,"DUVALL",null,"N",1]
[98020,"EDMONDS",null,"Y",1]
[98020,"WOODWAY",null,"Y",2]
[98021,"BOTHELL",null,"Y",1]
[98021,"KENNARD CORNER",null,"Y",2]
[98021,"QUEENSBOROUGH",null,"Y",3]
[98021,"THRASHERS CORNER",null,"Y",4]
[98022,"CRYSTAL MOUNTAIN",null,"Y",1]
[98022,"CUMBERLAND",null,"Y",2]
[98022,"ENUMCLAW",null,"Y",3]
[98022,"GREENWATER",null,"Y",4]
[98022,"KRAIN",null,"Y",5]
[98022,"OSCEOLA",null,"Y",6]
[98022,"WABASH",null,"Y",7]
[98023,"AUBURN",null,"Y",1]
[98023,"FEDERAL WAY",null,"Y",2]
[98023,"WESTFAIR",null,"Y",2]
[98024,"FALL CITY",null,"Y",1]
[98024,"LAKE ALICE",null,"Y",2]
[98024,"SPRING GLEN",null,"Y",3]
[98025,"HOBART",null,"N",1]
[98026,"EDMONDS",null,"N",1]
[98027,"COAL CREEK",null,"Y",1]
[98027,"ISSAQUAH",null,"Y",2]
[98027,"PINE LAKE",null,"Y",3]
[98028,"BOTHELL",null,"Y",1]
[98028,"KENMORE",null,"Y",2]
[98028,"SEATTLE",null,"Y",3]
[98029,"ISSAQUAH",null,"N",1]
[98031,"KENT",null,"N",1]
[98032,"KENT",null,"Y",1]
[98032,"MIDWAY",null,"Y",2]
[98032,"WOODMONT BEACH",null,"Y",3]
[98033,"HOUGHTON",null,"Y",1]
[98033,"JUANITA",null,"Y",2]
[98033,"KIRKLAND",null,"Y",3]
[98033,"TOTEM LAKE",null,"Y",4]
[98034,"JUANITA",null,"Y",1]
[98034,"KINGSGATE",null,"Y",2]
[98034,"KIRKLAND",null,"Y",3]
[98034,"TOTEM LAKE",null,"Y",4]
[98035,"KENT",null,"N",1]
[98036,"ALDERWOOD MANOR",null,"Y",1]
[98036,"BRIER",null,"Y",2]
[98036,"LYNNWOOD",null,"Y",3]
[98036,"SEATTLE HEIGHTS",null,"Y",4]
[98037,"LYNNWOOD",null,"N",1]
[98038,"FOUR CORNERS",null,"Y",1]
[98038,"MAPLE VALLEY",null,"Y",2]
[98038,"WILDERNESS VILLAGE",null,"Y",3]
[98039,"MEDINA",null,"N",1]
[98040,"MERCER ISLAND",null,"N",1]
[98041,"BOTHELL",null,"N",1]
[98042,"COVINGTON",null,"Y",1]
[98042,"KENT",null,"Y",2]
[98042,"LAKE SAWYER",null,"Y",3]
[98043,"MOUNTLAKE TERRACE",null,"N",1]
[98045,"CEDAR FALLS",null,"Y",1]
[98045,"DENNY CREEK",null,"Y",2]
[98045,"NORTH BEND",null,"Y",3]
[98046,"LYNNWOOD",null,"N",1]
[98047,"AUBURN",null,"Y",1]
[98047,"AUBURN",null,"Y",2]
[98047,"PACIFIC",null,"Y",3]
[98050,"PRESTON",null,"N",1]
[98051,"KANASKAT",null,"Y",1]
[98051,"PALMER",null,"Y",2]
[98051,"RAVENSDALE",null,"Y",3]
[98052,"ADELAIDE",null,"Y",1]
[98052,"AMES LAKE",null,"Y",2]
[98052,"AVONDALE",null,"Y",3]
[98052,"EARLMOUNT",null,"Y",4]
[98052,"REDMOND",null,"Y",5]
[98053,"REDMOND",null,"N",1]
[98054,"AUBURN",null,"N",1]
[98054,"REDONDO",null,"N",1]
[98054,"SEATTLE",null,"N",1]
[98055,"RENTON",null,"N",1]
[98056,"HAZELWOOD",null,"Y",1]
[98056,"HIGHLANDS",null,"Y",2]
[98056,"KENNYDALE",null,"Y",3]
[98056,"NEWCASTLE",null,"Y",4]
[98056,"RENTON",null,"Y",5]
[98057,"RENTON",null,"N",1]
[98058,"CASCADE",null,"Y",1]
[98058,"FAIRWOOD",null,"Y",2]
[98058,"RENTON",null,"Y",3]
[98059,"NEWCASTLE",null,"Y",1]
[98059,"RENTON",null,"Y",2]
[98060,"SEATTLE",null,"N",1]
[98061,"MANITOU BEACH",null,"Y",1]
[98061,"ROLLINGBAY",null,"Y",2]
[98062,"SEAHURST",null,"N",1]
[98063,"AUBURN",null,"Y",1]
[98063,"FEDERAL WAY",null,"Y",2]
[98064,"KENT",null,"N",1]
[98065,"SNOQUALMIE",null,"N",1]
[98068,"ALPENTAL",null,"Y",1]
[98068,"HYAK",null,"Y",2]
[98068,"SNOQUALMIE",null,"Y",3]
[98068,"SNOQUALMIE PASS",null,"Y",5]
[98070,"DOCKTON",null,"Y",1]
[98070,"VASHON",null,"Y",2]
[98070,"VASHON ISLAND",null,"Y",3]
[98071,"AUBURN",null,"Y",1]
[98071,"AUBURN",null,"Y",2]
[98072,"COTTAGE LAKE",null,"Y",1]
[98072,"WOODINVILLE",null,"Y",2]
[98073,"REDMOND",null,"N",1]
[98082,"BOTHELL",null,"Y",1]
[98082,"MILL CREEK",null,"Y",2]
[98083,"KIRKLAND",null,"N",1]
[98092,"AUBURN",null,"N",1]
[98093,"AUBURN",null,"Y",1]
[98093,"FEDERAL WAY",null,"Y",2]
[98101,"SEATTLE",null,"Y",1]
[98101,"TIMES SQUARE",null,"Y",2]
[98102,"BROADWAY",null,"Y",1]
[98102,"CAPITOL HILL",null,"Y",2]
[98102,"SEATTLE",null,"Y",3]
[98103,"GREENWOOD",null,"Y",1]
[98103,"SEATTLE",null,"Y",2]
[98103,"WALLINGFORD",null,"Y",3]
[98104,"INTERNATIONAL",null,"Y",1]
[98104,"POINEER SQUARE",null,"Y",2]
[98104,"SEATTLE",null,"Y",3]
[98105,"SEATTLE",null,"Y",1]
[98105,"UNIVERSITY",null,"Y",2]
[98106,"SEATTLE",null,"Y",1]
[98106,"WHITE CENTER",null,"Y",2]
[98107,"BALLARD",null,"Y",1]
[98107,"SEATTLE",null,"Y",2]
[98108,"SEATTLE",null,"Y",1]
[98108,"TUKWILA",null,"Y",2]
[98109,"QUEEN ANNE",null,"Y",1]
[98109,"SEATTLE",null,"Y",2]
[98110,"BAINBRIDGE ISLAND",null,"Y",1]
[98110,"SEATTLE",null,"Y",2]
[98111,"SEATTLE",null,"N",1]
[98112,"MADISON PARK",null,"Y",1]
[98112,"SEATTLE",null,"Y",2]
[98114,"SEATTLE",null,"N",1]
[98115,"SEATTLE",null,"Y",1]
[98115,"SEATTLE NAVAL SUPPORT ACTIVI",null,"Y",2]
[98115,"WEDGWOOD",null,"Y",3]
[98116,"SEATTLE",null,"Y",1]
[98116,"WEST SEATTLE",null,"Y",2]
[98117,"CROWN HILL",null,"Y",1]
[98117,"SEATTLE",null,"Y",2]
[98118,"COLUMBIA",null,"Y",1]
[98118,"SEATTLE",null,"Y",2]
[98119,"INTERBAY",null,"Y",1]
[98119,"SEATTLE",null,"Y",2]
[98121,"SEATTLE",null,"N",1]
[98122,"EAST UNION",null,"Y",1]
[98122,"SEATTLE",null,"Y",2]
[98124,"SEATTLE",null,"N",1]
[98125,"LAKE CITY",null,"Y",1]
[98125,"NORTHGATE",null,"Y",2]
[98125,"SEATTLE",null,"Y",3]
[98126,"SEATTLE",null,"Y",1]
[98126,"WESTWOOD VILLAGE",null,"Y",2]
[98129,"SEATTLE",null,"Y",2]
[98130,"SEATTLE",null,"N",1]
[98131,"SEATTLE",null,"N",1]
[98132,"SEATTLE",null,"N",1]
[98133,"BITTER LAKE",null,"Y",1]
[98133,"BITTER LAKE",null,"Y",1]
[98133,"RICHMOND HIGHLANDS",null,"Y",2]
[98133,"SEATTLE",null,"Y",3]
[98133,"SHORELINE",null,"Y",4]
[98134,"SEATTLE",null,"N",1]
[98136,"SEATTLE",null,"Y",1]
[98136,"WESTWOOD",null,"Y",2]
[98138,"SEATTLE",null,"Y",1]
[98138,"TUKWILA",null,"Y",2]
[98140,"SEATTLE",null,"N",1]
[98144,"BEACON HILL",null,"Y",1]
[98144,"SEATTLE",null,"Y",2]
[98145,"SEATTLE",null,"N",1]
[98146,"BURIEN",null,"Y",1]
[98146,"SEATTLE",null,"Y",2]
[98146,"SHOREWOOD",null,"Y",3]
[98146,"WHITE CENTER",null,"Y",4]
[98148,"BURIEN",null,"Y",1]
[98148,"DES MOINES",null,"Y",2]
[98148,"NORMANDY PARK",null,"Y",3]
[98148,"SEATAC",null,"Y",4]
[98148,"SEATTLE",null,"Y",5]
[98150,"SEATTLE",null,"N",1]
[98151,"SEATTLE",null,"N",1]
[98154,"SEATTLE",null,"N",1]
[98155,"FOREST PARK",null,"Y",1]
[98155,"KENMORE",null,"Y",2]
[98155,"LK FOREST PARK",null,"Y",2]
[98155,"NORTH CITY",null,"Y",3]
[98155,"SEATTLE",null,"Y",4]
[98155,"SHORELINE",null,"Y",5]
[98158,"SAFECO PLAZA",null,"Y",1]
[98158,"SEATAC AIRPORT",null,"Y",2]
[98158,"SEATTLE",null,"Y",2]
[98160,"RICHMOND BEACH",null,"Y",1]
[98160,"SEATTLE",null,"Y",2]
[98161,"SEATTLE",null,"N",1]
[98164,"SEATTLE",null,"N",1]
[98166,"BURIEN",null,"Y",1]
[98166,"NORMANDY PARK",null,"Y",2]
[98166,"SEATTLE",null,"Y",3]
[98168,"BURIEN",null,"Y",1]
[98168,"SEATAC",null,"Y",2]
[98168,"SEATTLE",null,"Y",3]
[98168,"TUKWILA",null,"Y",4]
[98171,"SEATTLE",null,"N",1]
[98174,"SEATTLE",null,"N",1]
[98177,"BITTER LAKE",null,"Y",1]
[98177,"RICHMOND BEACH",null,"Y",2]
[98177,"SEATTLE",null,"Y",3]
[98177,"SHORELINE",null,"Y",4]
[98177,"THE HIGHLANDS",null,"Y",5]
[98178,"ALLENTOWN",null,"Y",1]
[98178,"BRYN MAWR",null,"Y",1]
[98178,"SEATTLE",null,"Y",2]
[98178,"SKYWAY",null,"Y",3]
[98178,"TUKWILA",null,"Y",4]
[98181,"SEATTLE",null,"Y",3]
[98184,"SEATTLE",null,"Y",2]
[98185,"SEATTLE",null,"Y",2]
[98188,"DUWAMISH",null,"Y",1]
[98188,"MCMICKEN HEIGHTS",null,"Y",2]
[98188,"RIVERTON",null,"Y",3]
[98188,"SEATAC",null,"Y",4]
[98188,"SEATTLE",null,"Y",5]
[98188,"TUKWILA",null,"Y",6]
[98191,"SEATTLE",null,"Y",2]
[98195,"SEATTLE",null,"Y",1]
[98198,"DES MOINES",null,"Y",1]
[98198,"NORMANDY PARK",null,"Y",2]
[98198,"REDONDO",null,"Y",3]
[98198,"REDONDO BEACH",null,"Y",3]
[98198,"SEATAC",null,"Y",4]
[98198,"SEATTLE",null,"Y",5]
[98199,"FORT LAWTON",null,"Y",1]
[98199,"MAGNOLIA",null,"Y",2]
[98199,"SEATTLE",null,"Y",3]
[98201,"EVERETT",null,"N",1]
[98203,"EVERETT",null,"Y",1]
[98203,"LOWELL",null,"Y",2]
[98203,"PINEHURST",null,"Y",3]
[98204,"EASTMONT",null,"Y",1]
[98204,"EVERETT",null,"Y",2]
[98204,"SILVER LAKE",null,"Y",3]
[98205,"EVERETT",null,"N",1]
[98206,"EVERETT",null,"N",1]
[98207,"EVERETT",null,"Y",1]
[98208,"EVERETT",null,"N",1]
[98220,"ACME",null,"Y",1]
[98220,"SAXON",null,"Y",2]
[98221,"ANACORTES",null,"Y",1]
[98221,"GUEMES",null,"Y",3]
[98221,"SIMILK BEACH",null,"Y",5]
[98222,"ANACORTES",null,"Y",1]
[98222,"BLAKELY ISLAND",null,"Y",2]
[98223,"ARLINGTON",null,"Y",1]
[98223,"BRYANT",null,"Y",2]
[98223,"OSO",null,"Y",3]
[98223,"SMOKEY POINT",null,"Y",4]
[98224,"BARING",null,"Y",1]
[98224,"BARING",null,"Y",2]
[98225,"BELLINGHAM",null,"Y",1]
[98225,"CHUCKANUT",null,"Y",2]
[98225,"FAIRHAVEN",null,"Y",3]
[98225,"MARIETTA",null,"Y",4]
[98226,"BAKERVIEW",null,"Y",1]
[98226,"BELLINGHAM",null,"Y",2]
[98226,"SILVER BEACH",null,"Y",3]
[98227,"BELLINGHAM",null,"N",1]
[98228,"BELLINGHAM",null,"N",1]
[98230,"BIRCH BAY",null,"Y",1]
[98230,"BLAINE",null,"Y",2]
[98230,"BLAINE AIR FORCE STATION",null,"Y",3]
[98231,"BLAINE",null,"N",1]
[98232,"ALLEN",null,"Y",1]
[98232,"BOW",null,"Y",2]
[98232,"EDISON",null,"Y",3]
[98232,"SAMISH ISLAND",null,"Y",4]
[98233,"ALGER",null,"Y",1]
[98233,"BURLINGTON",null,"Y",2]
[98233,"UPPER SKAGIT INDIAN RESERVAT",null,"Y",3]
[98235,"CLEARLAKE",null,"N",1]
[98236,"CLINTON",null,"Y",1]
[98236,"MAXWELTON",null,"Y",2]
[98236,"POSSESSION",null,"Y",3]
[98237,"CONCRETE",null,"N",1]
[98238,"CONWAY",null,"N",1]
[98239,"COUPEVILLE",null,"N",1]
[98240,"CUSTER",null,"N",1]
[98241,"DARRINGTON",null,"N",1]
[98243,"DEER HARBOR",null,"N",1]
[98244,"DEMING",null,"Y",1]
[98244,"GLACIER",null,"Y",2]
[98244,"KENDALL",null,"Y",3]
[98244,"NOOKSACK INDIAN RESERVATION",null,"Y",4]
[98244,"WELCOME",null,"Y",5]
[98245,"EASTSOUND",null,"N",1]
[98246,"BOW",null,"N",1]
[98247,"EVERSON",null,"Y",1]
[98247,"STRANDELL",null,"Y",3]
[98247,"VAN BUREN",null,"Y",4]
[98248,"FERNDALE",null,"Y",1]
[98248,"PLEASANT VALLEY",null,"Y",2]
[98249,"FREELAND",null,"N",1]
[98250,"ARGYLE",null,"Y",1]
[98250,"FRIDAY HARBOR",null,"Y",1]
[98250,"ROCHE HARBOR",null,"Y",2]
[98250,"SAN JUAN ISLAND",null,"Y",3]
[98251,"GOLD BAR",null,"N",1]
[98252,"GRANITE FALLS",null,"N",1]
[98253,"GREENBANK",null,"N",1]
[98255,"HAMILTON",null,"N",1]
[98256,"INDEX",null,"N",1]
[98257,"LA CONNER",null,"N",1]
[98258,"HARTFORD",null,"Y",1]
[98258,"LAKE STEVENS",null,"Y",2]
[98259,"LAKEWOOD",null,"N",1]
[98260,"LANGLEY",null,"N",1]
[98261,"LOPEZ ISLAND",null,"Y",1]
[98261,"PORT STANLEY",null,"Y",2]
[98262,"LUMMI ISLAND",null,"Y",1]
[98262,"SNUG HARBOR",null,"Y",2]
[98263,"LYMAN",null,"N",1]
[98264,"LYNDEN",null,"N",1]
[98266,"MAPLE FALLS",null,"N",1]
[98267,"MARBLEMOUNT",null,"N",1]
[98270,"MARYSVILLE",null,"N",1]
[98271,"MARYSVILLE",null,"Y",1]
[98271,"TULALIP",null,"Y",2]
[98272,"MONROE",null,"Y",1]
[98272,"NOVELTY",null,"Y",2]
[98273,"MOUNT VERNON",null,"N",1]
[98274,"MOUNT VERNON",null,"N",1]
[98275,"MUKILTEO",null,"N",1]
[98276,"EVERSON",null,"Y",1]
[98276,"NOOKSACK",null,"Y",2]
[98277,"AULT FIELD",null,"Y",1]
[98277,"OAK HARBOR",null,"Y",2]
[98278,"OAK HARBOR",null,"Y",1]
[98278,"WHIDBEY ISLAND NAVAL AIR",null,"Y",2]
[98279,"DOEBAY",null,"Y",1]
[98279,"OLGA",null,"Y",2]
[98280,"ORCAS",null,"N",1]
[98281,"POINT ROBERTS",null,"N",1]
[98283,"DIABLO",null,"Y",1]
[98283,"NEWHALEM",null,"Y",2]
[98283,"ROCKPORT",null,"Y",3]
[98284,"SEDRO WOOLLEY",null,"N",1]
[98286,"SHAW ISLAND",null,"N",1]
[98287,"SILVANA",null,"N",1]
[98288,"GROTTO",null,"Y",1]
[98288,"SCENIC",null,"Y",2]
[98288,"SKYKOMISH",null,"Y",3]
[98290,"CLEARVIEW",null,"Y",1]
[98290,"LARIMERS CORNER",null,"Y",2]
[98290,"MACHIAS",null,"Y",3]
[98290,"MALTBY",null,"Y",4]
[98290,"SNOHOMISH",null,"Y",5]
[98291,"SNOHOMISH",null,"N",1]
[98292,"CAMANO CITY",null,"Y",1]
[98292,"CAMANO ISLAND",null,"Y",2]
[98292,"ELGER BAY",null,"Y",3]
[98292,"STANWOOD",null,"Y",4]
[98293,"STARTUP",null,"N",1]
[98294,"SULTAN",null,"N",1]
[98295,"CLEARBROOK",null,"Y",1]
[98295,"SUMAS",null,"Y",2]
[98296,"SNOHOMISH",null,"N",1]
[98297,"WALDRON",null,"N",1]
[98303,"ANDERSON IS",null,"Y",1]
[98303,"ANDERSON ISLAND",null,"Y",2]
[98303,"VILLA BEACH",null,"Y",3]
[98303,"YOMAN FERRY",null,"Y",4]
[98304,"ASHFORD",null,"Y",1]
[98304,"NATIONAL",null,"Y",2]
[98305,"BEAVER",null,"Y",1]
[98305,"SAPPHO",null,"Y",2]
[98310,"BREMERTON",null,"Y",1]
[98310,"BROWNSVILLE",null,"Y",2]
[98310,"CROSBY",null,"Y",3]
[98310,"EAST BREMERTON",null,"Y",4]
[98310,"GILBERTON",null,"Y",5]
[98310,"MEADOWDALE",null,"Y",6]
[98310,"SHERIDAN PARK",null,"Y",7]
[98311,"BREMERTON",null,"Y",1]
[98312,"BREM",null,"Y",1]
[98312,"BREMERTON",null,"Y",2]
[98312,"CAMP UNION",null,"Y",3]
[98312,"CHICO",null,"Y",4]
[98312,"ENETAI",null,"Y",5]
[98312,"ERLANDS POINT",null,"Y",6]
[98312,"HOLLY",null,"Y",7]
[98312,"KITSAP LAKE",null,"Y",8]
[98312,"MARINE DRIVE",null,"Y",9]
[98312,"NAVY YARD CITY",null,"Y",10]
[98312,"ROCKY POINT",null,"Y",11]
[98312,"WEST HILLS",null,"Y",12]
[98312,"WEST PARK",null,"Y",13]
[98312,"WILDCAT LAKE",null,"Y",14]
[98314,"BREMERTON",null,"N",1]
[98315,"BANGOR",null,"Y",1]
[98315,"BANGOR SUBMARINE BASE",null,"Y",2]
[98315,"SILVERDALE",null,"Y",3]
[98320,"BRINNON",null,"N",1]
[98321,"BUCKLEY",null,"Y",1]
[98321,"BURNETT",null,"Y",2]
[98322,"BURLEY",null,"N",1]
[98323,"CARBONADO",null,"N",1]
[98324,"CARLSBORG",null,"N",1]
[98325,"CHIMACUM",null,"Y",1]
[98325,"SHINE",null,"Y",2]
[98326,"CLALLAM BAY",null,"Y",1]
[98326,"LAKE OZETTE",null,"Y",2]
[98326,"OZETTE",null,"Y",3]
[98327,"DUPONT",null,"N",1]
[98328,"ALDER",null,"Y",1]
[98328,"EATONVILLE",null,"Y",2]
[98329,"GIG HARBOR",null,"N",1]
[98330,"ELBE",null,"N",1]
[98331,"BOGACHIEL",null,"Y",1]
[98331,"CLEARWATER",null,"Y",2]
[98331,"FORKS",null,"Y",3]
[98331,"KALALOCK",null,"Y",4]
[98331,"QUEETS",null,"Y",5]
[98331,"UPPER HOH",null,"Y",6]
[98332,"GIG HARBOR",null,"N",1]
[98333,"FOX IS",null,"Y",1]
[98333,"FOX ISLAND",null,"Y",1]
[98333,"SHOREWOOD BEACH",null,"Y",2]
[98333,"SYLVAN",null,"Y",3]
[98334,"SEQUIM",null,"N",1]
[98335,"ARLETTA",null,"Y",1]
[98335,"ARTONDALE",null,"Y",2]
[98335,"CRESCENT VALLEY",null,"Y",3]
[98335,"CROMWELL",null,"Y",4]
[98335,"ELGIN",null,"Y",5]
[98335,"GIG HARBOR",null,"Y",6]
[98335,"GLENCOVE",null,"Y",7]
[98335,"KEY CENTER",null,"Y",8]
[98335,"PICNIC POINT",null,"Y",9]
[98335,"POINT FOSDICK",null,"Y",10]
[98335,"PT FOSDICK",null,"Y",10]
[98335,"PURDY",null,"Y",11]
[98335,"RAFT IS",null,"Y",12]
[98335,"RAFT ISLAND",null,"Y",12]
[98335,"ROSEDALE",null,"Y",13]
[98335,"SHORE ACRES",null,"Y",14]
[98335,"SUNNY BAY",null,"Y",15]
[98335,"SUNRISE BEACH",null,"Y",16]
[98335,"VICTOR",null,"Y",17]
[98335,"WARREN",null,"Y",18]
[98335,"WAUNA SHORES",null,"Y",19]
[98335,"WOLLOCHET",null,"Y",20]
[98336,"CARRIAGE HILL",null,"Y",1]
[98336,"GLENOMA",null,"Y",2]
[98336,"KOSMOS",null,"Y",3]
[98337,"BREMERTON",null,"Y",1]
[98337,"GORST",null,"Y",2]
[98338,"GRAHAM",null,"Y",1]
[98338,"HARBOR HEIGHTS",null,"Y",2]
[98338,"THRIFT",null,"Y",3]
[98339,"HADLOCK",null,"Y",1]
[98339,"IRONDALE",null,"Y",2]
[98339,"OAK BAY",null,"Y",3]
[98339,"PORT HADLOCK",null,"Y",4]
[98340,"HANSVILLE",null,"N",1]
[98342,"INDIANOLA",null,"N",1]
[98343,"AGATE BEACH",null,"Y",1]
[98343,"CRANE",null,"Y",2]
[98343,"CRESCENT BEACH",null,"Y",3]
[98343,"JOYCE",null,"Y",4]
[98344,"KAPOWSIN",null,"N",1]
[98345,"KEYPORT",null,"N",1]
[98346,"EGLON",null,"Y",1]
[98346,"KINGSTON",null,"Y",2]
[98348,"LA GRANDE",null,"N",1]
[98349,"HERRON IS",null,"Y",1]
[98349,"HERRON ISLAND",null,"Y",1]
[98349,"HOME",null,"Y",2]
[98349,"LAKEBAY",null,"Y",3]
[98350,"LA PUSH",null,"N",1]
[98351,"LAKEBAY",null,"Y",1]
[98351,"LONGBRANCH",null,"Y",2]
[98352,"SUMNER",null,"N",1]
[98353,"MANCHESTER",null,"N",1]
[98354,"MILTON",null,"N",1]
[98355,"CARLSON",null,"Y",1]
[98355,"MINERAL",null,"Y",2]
[98356,"LINDBERG",null,"Y",1]
[98356,"MORTON",null,"Y",2]
[98357,"CAPE FLATTERY",null,"Y",1]
[98357,"MAKAH AFB",null,"Y",2]
[98357,"NEAH BAY",null,"Y",3]
[98357,"TATOOSH IS",null,"Y",4]
[98357,"TATOOSH ISLAND",null,"Y",4]
[98358,"FORT FLAGLER",null,"Y",1]
[98358,"FT FLAGLER",null,"Y",1]
[98358,"INDIAN IS",null,"Y",2]
[98358,"INDIAN ISLAND",null,"Y",2]
[98358,"MARROWSTONE IS",null,"Y",3]
[98358,"MARROWSTONE ISLAND",null,"Y",3]
[98358,"NORDLAND",null,"Y",4]
[98359,"FRAGARIA",null,"Y",1]
[98359,"OLALLA",null,"Y",2]
[98359,"OLALLA VALLEY",null,"Y",3]
[98360,"CROCKER",null,"Y",1]
[98360,"ELECTRON",null,"Y",2]
[98360,"OHOP",null,"Y",3]
[98360,"ORTING",null,"Y",4]
[98361,"PACKWOOD",null,"N",1]
[98362,"AGNEW",null,"Y",1]
[98362,"FAIRHOLM",null,"Y",2]
[98362,"GALES ADDITION",null,"Y",3]
[98362,"LAKE CRESCENT",null,"Y",4]
[98362,"MAPLE GROVE",null,"Y",5]
[98362,"MOUNT PLEASANT",null,"Y",6]
[98362,"PHYST",null,"Y",7]
[98362,"PORT ANGELES",null,"Y",8]
[98362,"PT ANGELES",null,"Y",9]
[98362,"SOL DUC HOT SPRINGS",null,"Y",10]
[98363,"PORT ANGELES",null,"Y",1]
[98364,"LITTLE BOSTON",null,"Y",1]
[98364,"PORT GAMBLE",null,"Y",2]
[98365,"BEAVER VALLEY",null,"Y",1]
[98365,"PORT HADLOCK",null,"Y",2]
[98365,"PORT LUDLOW",null,"Y",3]
[98366,"ANNAPOLIS",null,"Y",1]
[98366,"COLBY",null,"Y",2]
[98366,"COLBY",null,"Y",3]
[98366,"COLCHESTER",null,"Y",4]
[98366,"EAST PORT ORCHARD",null,"Y",5]
[98366,"FERNWOOD",null,"Y",6]
[98366,"FOREST CITY",null,"Y",7]
[98366,"HARPER",null,"Y",8]
[98366,"HORSESHOE LAKE",null,"Y",9]
[98366,"LAKE HOLIDAY",null,"Y",10]
[98366,"LONG LAKE",null,"Y",11]
[98366,"ORCHARD HEIGHTS",null,"Y",12]
[98366,"OVERLOOK",null,"Y",13]
[98366,"PARKWOOD",null,"Y",14]
[98366,"PORT ORCHARD",null,"Y",15]
[98366,"PT ORCHARD",null,"Y",16]
[98366,"SOUTH PARK VILLAGE",null,"Y",17]
[98366,"SUNNYSLOPE",null,"Y",18]
[98366,"VIEW PARK",null,"Y",19]
[98366,"WATERMAN",null,"Y",20]
[98366,"WAUTAUGA BEACH",null,"Y",21]
[98366,"WYE LAKE",null,"Y",22]
[98367,"PORT ORCHARD",null,"N",1]
[98368,"ADELMA BEACH",null,"Y",1]
[98368,"BECKETT POINT",null,"Y",2]
[98368,"DISCOVERY BAY",null,"Y",3]
[98368,"FORT WORDEN",null,"Y",4]
[98368,"FT WORDEN",null,"Y",4]
[98368,"GLEN COVE",null,"Y",5]
[98368,"LELAND",null,"Y",6]
[98368,"MATS MATS",null,"Y",7]
[98368,"PORT TOWNSEND",null,"Y",9]
[98368,"PROTECTION IS",null,"Y",10]
[98368,"PROTECTION ISLAND",null,"Y",10]
[98368,"PT TOWNSEND",null,"Y",9]
[98368,"TOWNSEND",null,"Y",11]
[98370,"BREIDABLICK",null,"Y",1]
[98370,"CENTRAL VALLEY",null,"Y",2]
[98370,"ISLAND LAKE",null,"Y",3]
[98370,"LEMOLO",null,"Y",4]
[98370,"LOFALL",null,"Y",5]
[98370,"PEARSON",null,"Y",6]
[98370,"POULSBO",null,"Y",7]
[98370,"SANDY HOOK PARK",null,"Y",8]
[98370,"SCANDIA",null,"Y",9]
[98370,"VIRGINIA",null,"Y",10]
[98371,"ALDERTON",null,"Y",1]
[98371,"EDGEWOOD",null,"Y",2]
[98371,"FIRWOOD",null,"Y",3]
[98371,"JOVITA",null,"Y",4]
[98371,"MAPLEWOOD",null,"Y",5]
[98371,"MEEKER",null,"Y",6]
[98371,"PUY",null,"Y",7]
[98371,"PUYALLUP",null,"Y",8]
[98371,"SUMMIT",null,"Y",9]
[98372,"EDGEWOOD",null,"Y",1]
[98372,"PUYALLUP",null,"Y",2]
[98373,"PUYALLUP",null,"Y",1]
[98374,"PUYALLUP",null,"Y",1]
[98375,"PUYALLUP",null,"Y",1]
[98376,"CENTER",null,"Y",1]
[98376,"DABOB",null,"Y",2]
[98376,"EAST QUILCENE",null,"Y",3]
[98376,"MOUNT WALKER",null,"Y",4]
[98376,"QUILCENE",null,"Y",5]
[98377,"RANDLE",null,"N",1]
[98378,"RETSIL",null,"N",1]
[98380,"MAPLE BEACH",null,"Y",1]
[98380,"MIAMI BEACH",null,"Y",2]
[98380,"SEABECK",null,"Y",3]
[98381,"HOKO",null,"Y",1]
[98381,"SEKIU",null,"Y",2]
[98382,"BLYN",null,"Y",1]
[98382,"DIAMOND POINT",null,"Y",2]
[98382,"DIAMOND PT",null,"Y",2]
[98382,"DUNGENESS",null,"Y",3]
[98382,"GARDINER",null,"Y",4]
[98382,"SEQUIM",null,"Y",5]
[98383,"OLYMPIC VIEW",null,"Y",1]
[98383,"SILVERDALE",null,"Y",2]
[98384,"SOUTH COLBY",null,"N",1]
[98385,"SOUTH PRAIRIE",null,"N",1]
[98386,"SOUTHWORTH",null,"N",1]
[98387,"BETHEL",null,"Y",1]
[98387,"ELK PLAIN",null,"Y",2]
[98387,"LOVELAND",null,"Y",3]
[98387,"SPANAWAY",null,"Y",4]
[98388,"KETRON IS",null,"Y",1]
[98388,"KETRON ISLAND",null,"Y",2]
[98388,"MCNEIL ISLAND",null,"Y",3]
[98388,"STEILACOOM",null,"Y",4]
[98390,"BONNEY LAKE",null,"Y",1]
[98390,"CEDARVIEW",null,"Y",2]
[98390,"DIERINGER",null,"Y",3]
[98390,"EDGEWOOD",null,"Y",4]
[98390,"FOBES HILL",null,"Y",5]
[98390,"LAKE TAPPS",null,"Y",6]
[98390,"PONDEROSA ESTATES",null,"Y",7]
[98390,"PRAIRIE RIDGE",null,"Y",8]
[98390,"RHODODENDRON PARK",null,"Y",9]
[98390,"SUMNER",null,"Y",10]
[98392,"STIEBELS CORNER",null,"Y",1]
[98392,"SUQUAMISH",null,"Y",2]
[98393,"TRACYTON",null,"N",1]
[98394,"VAUGHN",null,"N",1]
[98395,"WAUNA",null,"N",1]
[98396,"WILKESON",null,"N",1]
[98397,"LONGMIRE",null,"N",1]
[98398,"PARADISE INN",null,"N",1]
[98401,"TACOMA",null,"N",1]
[98402,"TACOMA",null,"N",1]
[98403,"TACOMA",null,"N",1]
[98404,"TACOMA",null,"N",1]
[98405,"TACOMA",null,"N",1]
[98406,"TACOMA",null,"N",1]
[98407,"RUSTON",null,"Y",1]
[98407,"TACOMA",null,"Y",2]
[98408,"TACOMA",null,"N",1]
[98409,"TACOMA",null,"Y",2]
[98411,"TACOMA",null,"N",1]
[98412,"TACOMA",null,"N",1]
[98413,"TACOMA",null,"N",1]
[98415,"TACOMA",null,"N",1]
[98416,"TACOMA",null,"Y",1]
[98418,"TACOMA",null,"N",1]
[98421,"TACOMA",null,"N",1]
[98422,"BROWNS POINT",null,"Y",1]
[98422,"TACOMA",null,"Y",3]
[98424,"FIFE",null,"Y",1]
[98424,"TACOMA",null,"Y",2]
[98430,"CAMP MURRAY",null,"Y",1]
[98430,"TACOMA",null,"Y",3]
[98431,"MADIGAN HOSPITAL",null,"Y",1]
[98431,"TACOMA",null,"Y",2]
[98433,"FORT LEWIS",null,"Y",1]
[98433,"FT LEWIS",null,"Y",1]
[98433,"TACOMA",null,"Y",2]
[98434,"N FORT LEWIS",null,"Y",1]
[98434,"N FT LEWIS",null,"Y",2]
[98434,"TACOMA",null,"Y",3]
[98438,"MCCHORD AFB",null,"Y",1]
[98438,"TACOMA",null,"Y",2]
[98439,"LAKEWOOD",null,"Y",1]
[98439,"MCCHORD AFB",null,"Y",2]
[98439,"TACOMA",null,"Y",4]
[98442,"TACOMA",null,"N",1]
[98443,"TACOMA",null,"N",1]
[98444,"PARKLAND",null,"Y",1]
[98444,"TACOMA",null,"Y",2]
[98445,"PARKLAND",null,"Y",1]
[98445,"TACOMA",null,"Y",2]
[98446,"PARKLAND",null,"Y",1]
[98446,"TACOMA",null,"Y",2]
[98447,"TACOMA",null,"N",1]
[98450,"TACOMA",null,"N",1]
[98455,"TACOMA",null,"N",1]
[98460,"TACOMA",null,"N",1]
[98464,"TACOMA",null,"Y",1]
[98464,"UNIVERSITY PLACE",null,"Y",2]
[98465,"TACOMA",null,"N",1]
[98466,"FIRCREST",null,"Y",1]
[98466,"TACOMA",null,"Y",2]
[98466,"UNIVERSITY PLACE",null,"Y",3]
[98467,"TACOMA",null,"Y",1]
[98467,"UNIVERSITY PLACE",null,"Y",2]
[98471,"TACOMA",null,"N",1]
[98477,"TACOMA",null,"N",1]
[98481,"TACOMA",null,"N",1]
[98492,"TACOMA",null,"Y",1]
[98492,"TILLICUM",null,"Y",2]
[98493,"TACOMA",null,"N",1]
[98494,"FORT STEILACOOM",null,"Y",1]
[98494,"TACOMA",null,"Y",2]
[98497,"OAKBROOK",null,"Y",1]
[98497,"TACOMA",null,"Y",2]
[98498,"AMERICAN LAKE",null,"Y",1]
[98498,"FORT STEILACOOM",null,"Y",2]
[98498,"LAKEWOOD",null,"Y",3]
[98498,"TACOMA",null,"Y",4]
[98499,"LAKEWOOD",null,"Y",1]
[98499,"LAKEWOOD CENTER",null,"Y",2]
[98499,"TACOMA",null,"Y",3]
[98501,"BOSTON HARBOR",null,"Y",1]
[98501,"MAYTOWN",null,"Y",2]
[98501,"NISQUALLY",null,"Y",3]
[98501,"OFFUTT LAKE",null,"Y",4]
[98501,"OLY",null,"Y",5]
[98501,"OLYMPIA",null,"Y",6]
[98501,"SCHNEIDERS PRAIRIE",null,"Y",7]
[98501,"SOUTH BAY",null,"Y",8]
[98501,"SOUTH SOUND",null,"Y",9]
[98501,"THOMPSON PLACE",null,"Y",10]
[98501,"TUMWATER",null,"Y",11]
[98501,"UNION MILLS",null,"Y",12]
[98502,"OLYMPIA",null,"Y",1]
[98502,"STA #7",null,"Y",2]
[98503,"LACEY",null,"Y",1]
[98503,"OLYMPIA",null,"Y",2]
[98504,"OLYMPIA",null,"N",1]
[98505,"OLYMPIA",null,"N",1]
[98506,"LACEY",null,"Y",1]
[98506,"OLYMPIA",null,"Y",2]
[98507,"OLYMPIA",null,"N",1]
[98508,"OLYMPIA",null,"N",1]
[98509,"LACEY",null,"Y",1]
[98509,"OLYMPIA",null,"Y",2]
[98512,"OLYMPIA",null,"Y",1]
[98512,"TUMWATER",null,"Y",2]
[98513,"LACEY",null,"Y",1]
[98513,"OLYMPIA",null,"Y",2]
[98516,"LACEY",null,"Y",1]
[98516,"OLYMPIA",null,"Y",2]
[98520,"ABERDEEN",null,"Y",1]
[98520,"ABERDEEN GARDENS",null,"Y",2]
[98520,"BAY CITY",null,"Y",3]
[98520,"BAY CITY",null,"Y",4]
[98520,"BENCH DRIVE",null,"Y",4]
[98520,"BENCH DRIVE",null,"Y",4]
[98520,"CENTRAL PARK",null,"Y",5]
[98520,"JUNCTION CITY",null,"Y",6]
[98520,"MARKHAM",null,"Y",7]
[98520,"OCOSTA",null,"Y",8]
[98520,"SOUTH ABERDEEN",null,"Y",9]
[98520,"WISHKAH",null,"Y",10]
[98522,"ADNA",null,"N",1]
[98524,"ALLYN",null,"N",1]
[98526,"AMANDA PARK",null,"N",1]
[98527,"BAY CENTER",null,"Y",1]
[98527,"BAY CENTER",null,"Y",2]
[98528,"BELFAIR",null,"N",1]
[98530,"BUCODA",null,"N",1]
[98531,"CENTRALIA",null,"Y",1]
[98531,"FORDS PRAIRIE",null,"Y",2]
[98531,"GRAND MOUND",null,"Y",3]
[98531,"WAUNCH PRAIRIE",null,"Y",4]
[98532,"BOISTFORT",null,"Y",1]
[98532,"BUNKER",null,"Y",2]
[98532,"CERES",null,"Y",3]
[98532,"CHEHALIS",null,"Y",4]
[98532,"CLAQUATO",null,"Y",5]
[98532,"DRYAD",null,"Y",6]
[98532,"FOREST",null,"Y",7]
[98532,"GUERRIER",null,"Y",8]
[98532,"LITTELL",null,"Y",9]
[98532,"MARYS CORNER",null,"Y",10]
[98532,"NAPAVINE",null,"Y",11]
[98532,"NEWAUKUM",null,"Y",12]
[98533,"CINEBAR",null,"N",1]
[98535,"COPALIS BEACH",null,"N",1]
[98536,"CARLISLE",null,"Y",1]
[98536,"COPALIS CROSSING",null,"Y",2]
[98537,"COSMOPOLIS",null,"N",1]
[98538,"CURTIS",null,"Y",1]
[98538,"KALBER",null,"Y",2]
[98538,"KLABER",null,"Y",3]
[98538,"WILDWOOD",null,"Y",4]
[98539,"DOTY",null,"N",1]
[98540,"EAST OLYMPIA",null,"Y",1]
[98540,"KELLYS KORNER",null,"Y",2]
[98541,"DECKERVILLE",null,"Y",1]
[98541,"ELMA",null,"Y",2]
[98541,"SAGINAW",null,"Y",3]
[98541,"SOUTH ELMA",null,"Y",4]
[98541,"WHITES",null,"Y",5]
[98542,"ETHEL",null,"N",1]
[98544,"GALVIN",null,"N",1]
[98546,"GRAPEVIEW",null,"N",1]
[98547,"GRAYLAND",null,"Y",1]
[98547,"HEATHER",null,"Y",2]
[98548,"CUSHMAN DAM",null,"Y",1]
[98548,"HOODSPORT",null,"Y",2]
[98550,"CHENOIS CREEK",null,"Y",1]
[98550,"GRAY GABLES",null,"Y",2]
[98550,"GRAYS HARBOR CITY",null,"Y",3]
[98550,"HOQUIAM",null,"Y",4]
[98550,"NEW LONDON",null,"Y",5]
[98550,"NEWTON",null,"Y",6]
[98550,"NISSON",null,"Y",7]
[98550,"OYHAT",null,"Y",8]
[98550,"WOODLAWN",null,"Y",9]
[98552,"HUMPTULIPS",null,"N",1]
[98554,"LEBAM",null,"N",1]
[98555,"ELDON",null,"Y",1]
[98555,"LILLIWAUP",null,"Y",2]
[98556,"LITTLEROCK",null,"N",1]
[98557,"GARDEN CITY",null,"Y",1]
[98557,"HILLGROVE",null,"Y",2]
[98557,"MC CLEARY",null,"Y",3]
[98557,"MCCLEARY",null,"Y",4]
[98558,"MC KENNA",null,"Y",1]
[98558,"MCKENNA",null,"Y",2]
[98559,"MALONE",null,"N",1]
[98560,"MATLOCK",null,"N",1]
[98561,"MENLO",null,"N",1]
[98562,"MOCLIPS",null,"N",1]
[98563,"ALDER GROVE",null,"Y",1]
[98563,"BRADY",null,"Y",2]
[98563,"GRISDALE",null,"Y",3]
[98563,"MELBOURNE",null,"Y",4]
[98563,"MONTESANO",null,"Y",5]
[98563,"PREACHERS SLOUGH",null,"Y",6]
[98563,"SOUTH MONTESANO",null,"Y",7]
[98564,"AJLUNE",null,"Y",1]
[98564,"MOSSYROCK",null,"Y",2]
[98565,"NAPAVINE",null,"N",1]
[98566,"NEILTON",null,"N",1]
[98568,"CEDARVILLE",null,"Y",1]
[98568,"GIBSON CREEK",null,"Y",2]
[98568,"OAKVILLE",null,"Y",3]
[98569,"OCEAN CITY",null,"Y",1]
[98569,"OCEAN SHORES",null,"Y",2]
[98570,"ALPHA",null,"Y",1]
[98570,"LACAMAS",null,"Y",2]
[98570,"ONALASKA",null,"Y",3]
[98571,"ALOHA",null,"Y",1]
[98571,"PACIFIC BEACH",null,"Y",2]
[98572,"PE ELL",null,"Y",1]
[98572,"PEELL",null,"Y",2]
[98575,"QUINAULT",null,"N",1]
[98576,"RAINIER",null,"Y",1]
[98576,"VAIL",null,"Y",2]
[98577,"FIRDALE",null,"Y",1]
[98577,"FRANCES",null,"Y",2]
[98577,"HOLCOMB",null,"Y",3]
[98577,"OLD WILLAPA",null,"Y",4]
[98577,"RAYMOND",null,"Y",5]
[98577,"WILLAPA",null,"Y",6]
[98579,"GATE",null,"Y",1]
[98579,"ROCHESTER",null,"Y",2]
[98580,"ROY",null,"N",1]
[98581,"RYDERWOOD",null,"N",1]
[98582,"SALKUM",null,"N",1]
[98583,"SATSOP",null,"N",1]
[98584,"HARSTINE",null,"Y",1]
[98584,"KAMILCHE",null,"Y",2]
[98584,"SHELTON",null,"Y",3]
[98585,"HARMONY",null,"Y",1]
[98585,"SILVER CREEK",null,"Y",2]
[98586,"NEMAH",null,"Y",1]
[98586,"SOUTH BEND",null,"Y",2]
[98587,"TAHOLAH",null,"N",1]
[98588,"TAHUYA",null,"N",1]
[98589,"TENINO",null,"N",1]
[98590,"NORTH COVE",null,"Y",1]
[98590,"TOKELAND",null,"Y",2]
[98591,"KNAB",null,"Y",1]
[98591,"TOLEDO",null,"Y",2]
[98592,"UNION",null,"N",1]
[98593,"VADER",null,"N",1]
[98595,"COHASSET BEACH",null,"Y",1]
[98595,"WESTPORT",null,"Y",2]
[98596,"EVALINE",null,"Y",1]
[98596,"SAINT URBANS",null,"Y",2]
[98596,"WINLOCK",null,"Y",3]
[98597,"FIVE CORNERS",null,"Y",1]
[98597,"YELM",null,"Y",2]
[98599,"OLYMPIA",null,"N",1]
[98601,"AMBOY",null,"Y",1]
[98601,"CHELATCHIE",null,"Y",2]
[98602,"APPLETON",null,"N",1]
[98603,"ARIEL",null,"Y",1]
[98603,"YALE",null,"Y",2]
[98604,"BATTLEGROUND",null,"N",1]
[98605,"BINGEN",null,"N",1]
[98606,"BRUSH PRAIRIE",null,"N",1]
[98607,"CAMAS",null,"N",1]
[98609,"CARROLLS",null,"N",1]
[98610,"CARSON",null,"N",1]
[98611,"CASTLE ROCK",null,"N",1]
[98612,"CATHLAMET",null,"Y",1]
[98612,"PUGET ISLAND",null,"Y",2]
[98613,"CENTERVILLE",null,"N",1]
[98614,"CHINOOK",null,"N",1]
[98616,"COUGAR",null,"N",1]
[98617,"DALLESPORT",null,"N",1]
[98619,"GLENWOOD",null,"N",1]
[98620,"GOLDENDALE",null,"Y",1]
[98620,"MARYHILL",null,"Y",2]
[98621,"GRAYS RIVER",null,"N",1]
[98622,"HEISSON",null,"N",1]
[98623,"HUSUM",null,"N",1]
[98624,"ILWACO",null,"N",1]
[98625,"KALAMA",null,"N",1]
[98626,"KELSO",null,"N",1]
[98628,"KLICKITAT",null,"N",1]
[98629,"LA CENTER",null,"N",1]
[98631,"LONG BEACH",null,"Y",1]
[98631,"OCEANSIDE",null,"Y",2]
[98632,"LONGVIEW",null,"N",1]
[98635,"LYLE",null,"N",1]
[98637,"NAHCOTTA",null,"N",1]
[98638,"NASELLE",null,"N",1]
[98639,"N BONNEVILLE",null,"Y",1]
[98639,"NORTH BONNEVILLE",null,"Y",2]
[98640,"OCEAN PARK",null,"N",1]
[98641,"OYSTERVILLE",null,"N",1]
[98642,"RIDGEFIELD",null,"N",1]
[98643,"ROSBURG",null,"N",1]
[98644,"SEAVIEW",null,"N",1]
[98645,"CASTLE ROCK",null,"Y",1]
[98645,"SILVERLAKE",null,"Y",1]
[98645,"TOUTLE",null,"Y",2]
[98647,"SKAMOKAWA",null,"N",1]
[98648,"SKAMANIA",null,"Y",1]
[98648,"STEVENSON",null,"Y",2]
[98649,"TOUTLE",null,"N",1]
[98650,"TROUT LAKE",null,"Y",1]
[98650,"TROUTLAKE",null,"Y",2]
[98651,"UNDERWOOD",null,"N",1]
[98660,"VANCOUVER",null,"N",1]
[98661,"VANCOUVER",null,"N",1]
[98662,"ORCHARDS",null,"Y",1]
[98662,"VANCOUVER",null,"Y",2]
[98663,"VANCOUVER",null,"N",1]
[98664,"VANCOUVER",null,"N",1]
[98665,"HAZEL DELL",null,"N",1]
[98665,"VANCOUVER",null,"N",1]
[98666,"VANCOUVER",null,"N",1]
[98667,"VANCOUVER",null,"N",1]
[98668,"VANCOUVER",null,"N",1]
[98670,"KLICKITAT",null,"Y",1]
[98670,"WAHKIACUS",null,"Y",2]
[98671,"WASHOUGAL",null,"N",1]
[98672,"WHITE SALMON",null,"N",1]
[98673,"WISHRAM",null,"N",1]
[98674,"WOODLAND",null,"N",1]
[98675,"YACOLT",null,"N",1]
[98682,"VANCOUVER",null,"N",1]
[98683,"VANCOUVER",null,"N",1]
[98684,"VANCOUVER",null,"N",1]
[98685,"VANCOUVER",null,"N",1]
[98686,"VANCOUVER",null,"N",1]
[98687,"VANCOUVER",null,"N",1]
[98801,"APPLEYARD",null,"Y",1]
[98801,"GRANT ROAD ADDITION",null,"Y",2]
[98801,"KENROY",null,"Y",3]
[98801,"MISSION SQUARE",null,"Y",4]
[98801,"PEARCOT",null,"Y",5]
[98801,"WENATCHEE",null,"Y",6]
[98801,"WENATCHEE HEIGHTS",null,"Y",7]
[98801,"WEST WENATCHEE",null,"Y",8]
[98802,"EAST WENATCHEE",null,"Y",1]
[98802,"WENATCHEE",null,"Y",2]
[98807,"WENATCHEE",null,"N",1]
[98811,"ARDENVOIR",null,"N",1]
[98812,"BREWSTER",null,"Y",1]
[98812,"MONSE",null,"Y",2]
[98812,"ROCKY BUTTE",null,"Y",3]
[98813,"BRIDGEPORT",null,"N",1]
[98814,"CARLTON",null,"N",1]
[98815,"CASHMERE",null,"N",1]
[98816,"CHELAN",null,"Y",1]
[98816,"HOLDEN VILLAGE",null,"Y",2]
[98816,"LAKESIDE",null,"Y",3]
[98816,"LUCERNE",null,"Y",4]
[98817,"CHELAN FALLS",null,"N",1]
[98819,"CONCONULLY",null,"N",1]
[98821,"DRYDEN",null,"N",1]
[98822,"ENTIAT",null,"N",1]
[98823,"EPHRATA",null,"N",1]
[98824,"GEORGE",null,"N",1]
[98826,"BLEWETT",null,"Y",1]
[98826,"BLEWETT",null,"Y",1]
[98826,"CHUMSTICK",null,"Y",2]
[98826,"LEAVENWORTH",null,"Y",3]
[98826,"MERRITT",null,"Y",4]
[98826,"PLAIN",null,"Y",5]
[98826,"TELMA",null,"Y",6]
[98826,"WINTON",null,"Y",7]
[98827,"LOOMIS",null,"N",1]
[98828,"MALAGA",null,"N",1]
[98829,"MALOTT",null,"N",1]
[98830,"MANSFIELD",null,"N",1]
[98831,"MANSON",null,"N",1]
[98832,"MARLIN",null,"Y",1]
[98832,"RUFF",null,"Y",2]
[98833,"MAZAMA",null,"Y",1]
[98833,"WINTHROP",null,"Y",2]
[98834,"METHOW",null,"N",1]
[98836,"MONITOR",null,"N",1]
[98837,"MAE",null,"Y",1]
[98837,"MOSES LAKE",null,"Y",2]
[98837,"RAUGUST",null,"Y",3]
[98837,"WHEELER",null,"Y",4]
[98840,"OKANOGAN",null,"N",1]
[98841,"DISAUTEL",null,"Y",1]
[98841,"OMAK",null,"Y",2]
[98843,"ORONDO",null,"N",1]
[98844,"CHESAW",null,"Y",1]
[98844,"MOLSON",null,"Y",2]
[98844,"OROVILLE",null,"Y",3]
[98845,"PALISADES",null,"N",1]
[98846,"AZWELL",null,"Y",1]
[98846,"AZWELL",null,"Y",2]
[98846,"PATEROS",null,"Y",3]
[98847,"PESHASTIN",null,"N",1]
[98848,"QUINCY",null,"Y",2]
[98848,"TRINIDAD",null,"Y",3]
[98848,"WINCHESTER",null,"Y",4]
[98849,"RIVERSIDE",null,"Y",1]
[98849,"SYNAREP",null,"Y",2]
[98850,"ROCK ISLAND",null,"N",1]
[98851,"ADCO",null,"Y",1]
[98851,"ADRIAN",null,"Y",2]
[98851,"LAKEVIEW PARK",null,"Y",3]
[98851,"SOAP LAKE",null,"Y",4]
[98852,"STEHEKIN",null,"N",1]
[98853,"STRATFORD",null,"N",1]
[98855,"AENEAS",null,"Y",1]
[98855,"ELLISFORD",null,"Y",2]
[98855,"HAVILLAH",null,"Y",3]
[98855,"NIGHTHAWK",null,"Y",4]
[98855,"TONASKET",null,"Y",5]
[98856,"TWISP",null,"N",1]
[98857,"WARDEN",null,"N",1]
[98858,"DOUGLAS",null,"Y",1]
[98858,"FARMER",null,"Y",2]
[98858,"WATERVILLE",null,"Y",3]
[98858,"WITHROW",null,"Y",4]
[98859,"BODIE",null,"Y",1]
[98859,"WAUCONDA",null,"Y",2]
[98860,"WILSON CREEK",null,"N",1]
[98862,"WINTHROP",null,"N",1]
[98901,"EAST SELAH",null,"Y",1]
[98901,"SUMACH",null,"Y",2]
[98901,"UNION GAP",null,"Y",3]
[98901,"YAKIMA",null,"Y",4]
[98901,"YAKIMA FIRING CENTER",null,"Y",5]
[98902,"AHTANUM",null,"Y",1]
[98902,"FRUITVALE",null,"Y",2]
[98902,"HARWOOD",null,"Y",3]
[98902,"POMONA",null,"Y",4]
[98902,"TAMPICO",null,"Y",5]
[98902,"WEIKEL",null,"Y",6]
[98902,"WEST SIDE",null,"Y",7]
[98902,"YAKIMA",null,"Y",8]
[98903,"FAIRVIEW",null,"Y",1]
[98903,"SOUTH BROADWAY",null,"Y",2]
[98903,"SUMACH",null,"Y",3]
[98903,"UNION GAP",null,"Y",4]
[98903,"YAKIMA",null,"Y",5]
[98904,"GLEED",null,"Y",1]
[98904,"YAKIMA",null,"Y",2]
[98907,"YAKIMA",null,"N",1]
[98908,"WIDE HOLLOW",null,"Y",1]
[98908,"YAKIMA",null,"Y",2]
[98909,"YAKIMA",null,"N",1]
[98920,"BROWNSTOWN",null,"N",1]
[98921,"BUENA",null,"N",1]
[98922,"CLE ELUM",null,"Y",1]
[98922,"LIBERTY",null,"Y",2]
[98922,"TEANAWAY",null,"Y",4]
[98923,"COWICHE",null,"N",1]
[98925,"EASTON",null,"N",1]
[98926,"ELLENSBURG",null,"Y",1]
[98926,"THRALI",null,"Y",2]
[98929,"GOOSE PRAIRIE",null,"Y",1]
[98929,"NACHES",null,"Y",2]
[98930,"GRANDVIEW",null,"N",1]
[98932,"CREWPORT",null,"Y",1]
[98932,"GRANGER",null,"Y",2]
[98933,"HARRAH",null,"N",1]
[98934,"KITTITAS",null,"N",1]
[98935,"MABTON",null,"N",1]
[98936,"MOXEE",null,"Y",1]
[98936,"MOXEE CITY",null,"Y",2]
[98937,"CLIFFDELL",null,"Y",1]
[98937,"CLIFFDELL",null,"Y",2]
[98937,"GOOSE PRAIRIE",null,"Y",3]
[98937,"NACHES",null,"Y",4]
[98937,"NILE",null,"Y",5]
[98937,"RIMROCK",null,"Y",6]
[98937,"WHITE PASS",null,"Y",7]
[98938,"OUTLOOK",null,"N",1]
[98939,"PARKER",null,"N",1]
[98940,"RONALD",null,"N",1]
[98941,"ROCKLYN",null,"Y",1]
[98941,"ROSLYN",null,"Y",2]
[98942,"SELAH",null,"N",1]
[98943,"SOUTH CLE ELUM",null,"N",1]
[98944,"SUNNYSIDE",null,"N",1]
[98946,"THORP",null,"N",1]
[98947,"TIETON",null,"N",1]
[98948,"TOPPENISH",null,"N",1]
[98950,"DORIS",null,"Y",1]
[98950,"ELLENSBURG",null,"Y",2]
[98950,"VANTAGE",null,"Y",3]
[98951,"DONALD",null,"Y",1]
[98951,"SAWYER",null,"Y",2]
[98951,"WAPATO",null,"Y",3]
[98952,"WHITE SWAN",null,"N",1]
[98953,"ZILLAH",null,"N",1]
[99001,"AIRWAY HEIGHTS",null,"N",1]
[99003,"CHATTAROY",null,"Y",1]
[99003,"MILAN",null,"Y",2]
[99004,"AMBER",null,"Y",1]
[99004,"CHENEY",null,"Y",2]
[99004,"TYLER",null,"Y",3]
[99005,"COLBERT",null,"N",1]
[99006,"DEER PARK",null,"N",1]
[99008,"EDWALL",null,"N",1]
[99009,"ELK",null,"N",1]
[99011,"FAIRCHILD AFB",null,"Y",1]
[99011,"FAIRCHILD AIR FORCE BASE",null,"Y",2]
[99012,"FAIRFIELD",null,"N",1]
[99013,"FORD",null,"N",1]
[99014,"FOUR LAKES",null,"N",1]
[99015,"FREEMAN",null,"Y",1]
[99015,"VALLEYFORD",null,"Y",2]
[99016,"GREENACRES",null,"N",1]
[99017,"LAMONT",null,"Y",1]
[99017,"SPRAGUE",null,"Y",2]
[99018,"LATAH",null,"N",1]
[99019,"LIBERTY LAKE",null,"N",1]
[99020,"MARSHALL",null,"N",1]
[99021,"GREEN BLUFF",null,"Y",1]
[99021,"MEAD",null,"Y",2]
[99022,"ESPANOLA",null,"Y",1]
[99022,"MEDICAL LAKE",null,"Y",2]
[99023,"MICA",null,"Y",1]
[99023,"VALLEYFORD",null,"Y",2]
[99025,"EAST FARMS",null,"Y",1]
[99025,"NEWMAN LAKE",null,"Y",2]
[99026,"NINE MILE FALLS",null,"Y",1]
[99027,"OTIS ORCHARDS",null,"Y",1]
[99029,"REARDAN",null,"N",1]
[99030,"ROCKFORD",null,"N",1]
[99031,"SPANGLE",null,"N",1]
[99032,"SPRAGUE",null,"N",1]
[99033,"TEKOA",null,"N",1]
[99034,"TUM TUM",null,"N",1]
[99034,"TUMTUM",null,"N",1]
[99036,"VALLEYFORD",null,"N",1]
[99037,"VERADALE",null,"N",1]
[99039,"WAVERLY",null,"N",1]
[99040,"WELLPINIT",null,"N",1]
[99101,"ADDY",null,"N",1]
[99102,"ALBION",null,"N",1]
[99103,"ALMIRA",null,"N",1]
[99104,"BELMONT",null,"Y",1]
[99104,"FARMINGTON",null,"Y",2]
[99105,"BENGE",null,"Y",1]
[99105,"BENGE",null,"Y",2]
[99107,"BOYDS",null,"Y",1]
[99107,"KETTLE FALLS",null,"Y",2]
[99109,"CHEWELAH",null,"N",1]
[99110,"CLAYTON",null,"Y",1]
[99110,"CLAYTON",null,"Y",2]
[99111,"COLFAX",null,"Y",1]
[99111,"COLFAX",null,"Y",2]
[99111,"DIAMOND",null,"Y",3]
[99113,"COLTON",null,"N",1]
[99114,"COLVILLE",null,"N",1]
[99115,"COULEE CITY",null,"N",1]
[99116,"COULEE DAM",null,"Y",1]
[99116,"MASON CITY",null,"Y",2]
[99117,"CRESTON",null,"N",1]
[99118,"CURLEW",null,"N",1]
[99119,"CUSICK",null,"N",1]
[99121,"DANVILLE",null,"N",1]
[99122,"DAVENPORT",null,"N",1]
[99123,"ELECTRIC CITY",null,"N",1]
[99124,"ELMER CITY",null,"N",1]
[99125,"ENDICOTT",null,"N",1]
[99126,"EVANS",null,"Y",1]
[99126,"KETTLE FALLS",null,"Y",2]
[99127,"EWAN",null,"Y",1]
[99127,"SAINT JOHN",null,"Y",2]
[99128,"FARMINGTON",null,"N",1]
[99129,"FRUITLAND",null,"Y",1]
[99129,"HUNTERS",null,"Y",2]
[99130,"GARFIELD",null,"N",1]
[99131,"GIFFORD",null,"N",1]
[99133,"GRAND COULEE",null,"N",1]
[99134,"HARRINGTON",null,"N",1]
[99135,"HARTLINE",null,"N",1]
[99136,"HAY",null,"Y",1]
[99136,"LACROSSE",null,"Y",2]
[99137,"CEDONIA",null,"Y",1]
[99137,"HUNTERS",null,"Y",2]
[99138,"INCHELIUM",null,"Y",1]
[99138,"KEWA",null,"Y",2]
[99139,"IONE",null,"N",1]
[99140,"KELLER",null,"N",1]
[99141,"KETTLE FALLS",null,"N",1]
[99143,"LA CROSSE",null,"Y",1]
[99143,"LACROSSE",null,"Y",2]
[99144,"LAMONA",null,"Y",1]
[99144,"ODESSA",null,"Y",2]
[99146,"LAURIER",null,"N",1]
[99147,"CRESTON",null,"Y",1]
[99147,"LINCOLN",null,"Y",2]
[99148,"DEER LAKE",null,"Y",1]
[99148,"LOON LAKE",null,"Y",2]
[99149,"MALDEN",null,"N",1]
[99150,"MALO",null,"N",1]
[99151,"MARCUS",null,"N",1]
[99152,"METALINE",null,"N",1]
[99153,"METALINE FALLS",null,"N",1]
[99154,"HARRINGTON",null,"Y",1]
[99154,"MOHLER",null,"Y",2]
[99155,"NESPELEM",null,"N",1]
[99156,"NEWPORT",null,"N",1]
[99157,"NORTHPORT",null,"N",1]
[99158,"OAKESDALE",null,"N",1]
[99159,"ODESSA",null,"N",1]
[99160,"KETTLE FALLS",null,"Y",1]
[99160,"ORIENT",null,"Y",2]
[99161,"PALOUSE",null,"N",1]
[99163,"PULLMAN",null,"N",1]
[99164,"PULLMAN",null,"N",1]
[99165,"PULLMAN",null,"N",1]
[99166,"REPUBLIC",null,"N",1]
[99167,"RICE",null,"N",1]
[99169,"RITZVILLE",null,"N",1]
[99170,"PLAZA",null,"Y",1]
[99170,"ROSALIA",null,"Y",2]
[99171,"SAINT JOHN",null,"N",1]
[99173,"SPRINGDALE",null,"N",1]
[99174,"STEPTOE",null,"N",1]
[99176,"THORNTON",null,"N",1]
[99179,"UNIONTOWN",null,"N",1]
[99180,"USK",null,"N",1]
[99181,"VALLEY",null,"N",1]
[99185,"WILBUR",null,"N",1]
[99201,"SPOKANE",null,"N",1]
[99202,"LIBERTY PARK",null,"Y",1]
[99202,"SPOKANE",null,"Y",2]
[99203,"MANITO",null,"Y",1]
[99203,"SPOKANE",null,"Y",2]
[99204,"SPOKANE",null,"N",1]
[99205,"SHADLE GARLAND",null,"Y",1]
[99205,"SPOKANE",null,"Y",2]
[99206,"SPOKANE",null,"N",1]
[99207,"SPOKANE",null,"N",1]
[99208,"SPOKANE",null,"N",1]
[99209,"SHADLE GARLAND",null,"Y",1]
[99209,"SPOKANE",null,"Y",2]
[99210,"SPOKANE",null,"N",1]
[99211,"SPOKANE",null,"N",1]
[99212,"MILLWOOD",null,"Y",1]
[99212,"SPOKANE",null,"Y",2]
[99213,"SPOKANE",null,"N",1]
[99214,"SPOKANE",null,"N",1]
[99215,"SPOKANE",null,"N",1]
[99216,"SPOKANE",null,"N",1]
[99217,"SPOKANE",null,"N",1]
[99218,"SPOKANE",null,"N",1]
[99219,"SPOKANE",null,"Y",1]
[99219,"SPOKANE INTL AIRPORT",null,"Y",2]
[99220,"LIBERTY PARK",null,"Y",1]
[99220,"SPOKANE",null,"Y",2]
[99223,"MANITO",null,"Y",1]
[99223,"SPOKANE",null,"Y",2]
[99224,"SPOKANE",null,"Y",1]
[99224,"SPOKANE INTL AIRPORT",null,"Y",2]
[99228,"SPOKANE",null,"N",1]
[99251,"SPOKANE",null,"N",1]
[99252,"SPOKANE",null,"Y",1]
[99252,"WASHINGTON WATER POWER CO",null,"Y",2]
[99256,"SPOKANE",null,"N",1]
[99258,"SPOKANE",null,"N",1]
[99260,"SPOKANE",null,"N",1]
[99299,"SPOKANE",null,"N",1]
[99301,"PASCO",null,"N",1]
[99302,"PASCO",null,"N",1]
[99320,"BENTON CITY",null,"Y",1]
[99320,"BENTON CITY",null,"Y",2]
[99320,"KIONA",null,"Y",3]
[99321,"BEVERLY",null,"Y",1]
[99321,"BEVERLY",null,"Y",2]
[99322,"BICKLETON",null,"Y",1]
[99322,"BICKLETON",null,"Y",2]
[99323,"BURBANK",null,"N",1]
[99324,"COLLEGE PLACE",null,"Y",1]
[99324,"COLLEGE PLACE",null,"Y",2]
[99326,"CONNELL",null,"N",1]
[99327,"CUNNINGHAM",null,"Y",1]
[99327,"OTHELLO",null,"Y",2]
[99328,"DAYTON",null,"N",1]
[99329,"DIXIE",null,"N",1]
[99330,"ELTOPIA",null,"N",1]
[99332,"HATTON",null,"Y",1]
[99332,"OTHELLO",null,"Y",2]
[99333,"HOOPER",null,"N",1]
[99335,"KAHLOTUS",null,"N",1]
[99336,"FINLEY",null,"Y",1]
[99336,"KENN",null,"Y",2]
[99336,"KENNEWICK",null,"Y",3]
[99337,"KENNEWICK",null,"N",1]
[99338,"KENNEWICK",null,"N",1]
[99341,"LIND",null,"N",1]
[99343,"BASIN CITY",null,"Y",1]
[99343,"BASIN CITY",null,"Y",2]
[99343,"MESA",null,"Y",3]
[99344,"OTHELLO",null,"Y",1]
[99344,"ROYAL SLOPE",null,"Y",2]
[99345,"PATERSON",null,"N",1]
[99346,"PLYMOUTH",null,"N",1]
[99347,"POMEROY",null,"N",1]
[99348,"PRESCOTT",null,"N",1]
[99349,"DESERT AIRE",null,"Y",1]
[99349,"MATTAWA",null,"Y",2]
[99350,"NORTH PROSSER",null,"Y",1]
[99350,"PROSSER",null,"Y",2]
[99352,"HANFORD WORKS",null,"Y",1]
[99352,"RICHLAND",null,"Y",2]
[99352,"WEST RICHLAND",null,"Y",3]
[99353,"RICHLAND",null,"Y",1]
[99353,"WEST RICHLAND",null,"Y",2]
[99356,"ROOSEVELT",null,"N",1]
[99357,"ROYAL CITY",null,"N",1]
[99359,"STARBUCK",null,"N",1]
[99360,"LOWDEN",null,"Y",1]
[99360,"TOUCHET",null,"Y",2]
[99361,"WAITSBURG",null,"N",1]
[99362,"WALLA WALLA",null,"N",1]
[99363,"WALLULA",null,"N",1]
[99371,"WASHTUCNA",null,"N",1]
[99401,"ANATONE",null,"N",1]
[99402,"ASOTIN",null,"N",1]
[99403,"CLARKSTON",null,"N",1]

{"sheet":"Notes","index":3,"n_rows":26,"n_cols":5,"rows_kept":26,"cut":false,"hidden":false,"merged":[]}
[]
[]
[null,null,null,"First make sure your security settings allow you to run macros:"]
[null,null,null,null,"Click the MS icon at upper left of the Excel window"]
[null,null,null,null,"then click Excel Options at the bottom of the menu that opens"]
[null,null,null,null,"Click Trust Center and then Trust Center Settings"]
[null,null,null,null,"then click Macro Settings"]
[null,null,null,null," make sure there is a check in the Trust Access to VBA box."]
[null,null,null,null,"Set your macro security level and then close everything."]
[]
[null,null,null,"AND","Go to 'Developer Ribbon'."]
[null,null,null,null,"Click Macro Security."]
[null,null,null,null,"Click 'Privacy Options'."]
[null,null,null,null,"Uncheck Document Inspector"]
[]
[null,null,null,"Also","Up above the column letters, above sheet tile bar you will see"]
[]
[]
[]
[]
[]
[]
[]
[null,null,null,null,"Click Options"]
[null,null,null,null,"Choose 'Enable this Content' in next window"]
[null,null,null,null,"Click 'OK' "]