{"text_format":"1","workbook":"xlsx","n_sheets":4,"sheets":["Sheet1","Sheet2","Sheet3","Notes"],"not_rendered":{"charts":0,"images":3,"macros":1,"external_links":1,"defined_names":1,"comments":0,"pivot_tables":0},"unopened":[],"bounds":{"document_bytes":16777216,"sheet_cells":100000,"rows_first":2000,"rows_last":500,"rows_between":2000,"halvings":0,"cell_chars":16384,"cell_head_chars":4096},"cells_cut":0,"cells_raw":0,"read":"whole","date_system":"1900"}

{"sheet":"Sheet1","index":0,"n_rows":44,"n_cols":4,"rows_kept":44,"cut":false,"hidden":false,"merged":[[2,0,2,4]]}
["JOBSHEET"]
[]
["¢ PLEASE E-MAIL A COPY OF THE FRONT PAGE OF YOUR CONTRACT FOR THIS JOB."]
["¢ IF A PUBLIC OR FEDERAL ENTITY IS LISTED AS THE OWNER, PLEASE E-MAIL A COPY OF THE PAYMENT BOND."]
["¢ E-MAILING A COPY OF THE PAYMENT BOND AND A COPY OF THE FRONT PAGE OF YOUR CONTRACT WILL PROTECT BOTH FERGUSON AND YOU."]
["¢E-MAIL THIS JOBSHEET TO: ","veronica.paz@Ferguson.com"]
["âFERGUSON'S CUSTOMER","Fire Suppression Services Incorporated","âNAME OF JOB","La Caille"]
["MAIN CUSTOMER NUMBER",376,"CUSTOMER'S JOB NUMBER","LACAI"]
["CUSTOMER'S STREET ADDRESS","3802 South 2300 East","â APN NUMBER OR AIN NUMBER"]
["CITY","Salt Lake City","TRACK & LOT NUMBERS"]
["STATE (2 LETTER ABREV.)","UT","âJOB ADDRESS LINE 1","9565 South Wasatch Boulevard"]
["ZIP CODE","84109-3421","JOB ADDRESS LINE 2"]
[null,null,"JOB ADDRESS LINE 3"]
["âGENERAL CONTRACTOR","FSS","CITY","Sandy"]
["GENERAL'S ADDRESS","3802 South 2300 East","STATE (2 LETTER ABREV.)","UT"]
["CITY","Millcreek","ZIP CODE",84092]
["STATE (2 LETTER ABREV.)","UT","JOBSITE CONTACT & PHONE NUMBER"]
["ZIP CODE",84109]
["PHONE",8012776464,"âESTIMATED MATERIAL AMOUNT $",6000]
["FAX",null,"IS THIS A PUBLIC WORKS JOB ?","No"]
[null,null,"COMMERCIAL, OR RESIDENTIAL JOB ?","Commercial"]
["âSURETY FOR BOND ","Old Republic Surety Company","IS THIS JOB TAX EXEMPT ? ","No"]
["SURETY MAILING ADDRESS","P.O. Box 1635","âPROPERTY OWNER","HOLLADAY 2550 LLC"]
["CITY","Milwaukee","OWNER'S ADDRESS","9565 S WASATCH BLVD"]
["STATE (2 LETTER ABREV.)","WI","CITY","Sandy"]
["ZIP CODE",5320,"STATE (2 LETTER ABREV.)","UT"]
["PHONE",8013521161,"ZIP CODE",84092]
["âPAYMENT BOND NUMBER","N/A","PHONE",8019421751]
[]
["IF YOU ARE A SUB OF A SUB, LIST THE SUBCONTRACTOR'S NAME AND ADDRESS BELOW:",null,"âBANK FINANCING THIS JOB ","Fire Suppression Services Inc."]
["âSUBCONTRACTOR",null,"BANK'S ADDRESS"]
["SUBCONTRACTOR'S ADDRESS",null,"CITY"]
["CITY",null,"STATE (2 LETTER ABREV.)"]
["STATE ",null,"ZIP CODE"]
["ZIP CODE"]
["PHONE"]
[]
["CREDIT DEPARTMENT USE ONLY BELOW THIS LINE"]
["BID #",null,"1ST SHIP DATE"]
["SURETY AM BEST RATING",null,"SALESMAN"]
["JOB ACCOUNT #",null,"BICA MEMBER #"]
[]
["Revised May, 2009"]
["Mods: 2014-04-01 Arun"]

{"sheet":"Sheet2","index":1,"n_rows":127,"n_cols":10,"rows_kept":127,"cut":false,"hidden":false,"merged":[]}
["CREDIT DEPARTMENT USE ONLY"]
["ver: 2014-04-02"]
["Copy and paste the highlighted cells (light green) below into Trilogie in order to submit this jobsheet."]
["CFM"]
["NEW"]
["Y"]
[{"$f":"INDIRECT(D7)","v":376},null,null,"Sheet1!B8",null,"CUST #"]
[{"$f":"IF((INDIRECT(D8))=\"\",\".\",(UPPER(INDIRECT(D8))))","v":"LA CAILLE"},null,null,"Sheet1!D7",null,"JOB NAME"]
["US",null,null,null,null,"JOB COUNTRY"]
[{"$f":"IF((INDIRECT(D10))=\"\",\".\",UPPER(INDIRECT(D10)))","v":"9565 SOUTH WASATCH BOULEVARD"},null,null,"Sheet1!D11",null,"JOB ADDRESS"]
[{"$f":"IF((INDIRECT(D11))=\"\",\".\",UPPER(INDIRECT(D11)))","v":"."},null,null,"Sheet1!D12"]
[{"$f":"IF((INDIRECT(D12))=\"\",\".\",UPPER(INDIRECT(D12)))","v":"."},null,null,"Sheet1!D13"]
[{"$f":"IF((INDIRECT(D13)=\"\"),99329,INDIRECT(D13))","v":84092},null,null,"Sheet1!D16",null,"JOB ZIP","Zip Multi",null,null,"City Loc"]
[{"$f":"IF(ISERROR($J15),\"9\",(IF(($J15>24),\"P5\",IF(($J15>18),\"P4\",IF(($J15>12),\"P3\",IF(($J15>6),\"P2\",\"9\"))))))","v":"9"}]
[{"$f":"IF(G15=\"Y\",J15,\"9\")","v":{"$error":"#N/A"}},{"$f":"IF(A15=0,\"ERROR! Check city spelling and/or zip\",\"\")","v":{"$error":"#N/A"}},null,null,null,"JOB CITY",{"$f":"VLOOKUP(A13,[1]Sheet3!$A$1:$D$65536,4,FALSE)","v":{"$error":"#N/A"}},null,null,{"$f":"SUMPRODUCT(([1]Sheet3!$B$3:$B$8009=[1]Sheet1!$D$14)*([1]Sheet3!$A$3:$A$8009=[1]Sheet1!$D$16)*([1]Sheet3!$E$3:$E$8009))","v":0}]
["E"]
[{"$f":"IF((INDIRECT(D17))=\"\",\".\",UPPER(INDIRECT(D17)))","v":"FSS"},null,null,"Sheet1!B14",null,"GC NAME"]
["US",null,null,null,null,"GC COUNTRY"]
[{"$f":"IF((INDIRECT(D19))=\"\",\".\",UPPER(INDIRECT(D19)))","v":"3802 SOUTH 2300 EAST"},null,null,"Sheet1!B15",null,"GC ADDRESS"]
[{"$f":"IF((INDIRECT(D20))=\"\",\".\",UPPER(INDIRECT(D20)))","v":"UT"},null,null,"Sheet1!B17"]
[".",null,null,"Sheet1!B18"]
[{"$f":"IF((INDIRECT(D22)=\"\"),99329,INDIRECT(D22))","v":84109},null,null,"Sheet1!B18",null,"GC ZIP"]
[{"$f":"IF(ISERROR($J24),\"9\",(IF(($J24>24),\"P5\",IF(($J24>18),\"P4\",IF(($J24>12),\"P3\",IF(($J24>6),\"P2\",\"9\"))))))","v":"9"}]
[{"$f":"IF(G24=\"Y\",J24,\"9\")","v":{"$error":"#N/A"}},{"$f":"IF(A24=0,\"ERROR! Check city spelling and/or zip\",\"\")","v":{"$error":"#N/A"}},null,null,null,"GC CITY",{"$f":"VLOOKUP(A22,[1]Sheet3!$A$1:$D$65536,4,FALSE)","v":{"$error":"#N/A"}},null,null,{"$f":"SUMPRODUCT(([1]Sheet3!$B$3:$B$8009=[1]Sheet1!$B$16)*([1]Sheet3!$A$3:$A$8009=[1]Sheet1!$B$18)*([1]Sheet3!$E$3:$E$8009))","v":0}]
["E"]
[{"$f":"IF(INDIRECT(D26)=0,\"806-111-1111\",INDIRECT(D26))","v":8012776464},null,null,"Sheet1!B19",null,"GC PHONE"]
[{"$f":"IF(INDIRECT(D27)=0,\"806-111-1111\",INDIRECT(D27))","v":"806-111-1111"},null,null,"Sheet1!B20",null,"GC FAX"]
["E",null,null,null,null,"SECONDARY SALESMAN"]
[17]
[{"$f":"IF((INDIRECT(D30))=\"\",\"WA\",UPPER(INDIRECT(D30)))","v":"UT"},null,null,"Sheet1!D15",null,"JOB STATE"]
[19]
[{"$f":"IF((INDIRECT(D32))=\"YES\",\"Y\",IF((INDIRECT(D32))=\"NO\",\"N\",IF((INDIRECT(D32))=\"\",\"N\",UPPER(INDIRECT(D32)))))","v":"N"},null,null,"Sheet1!D20",null,"MUNICIPAL JOB"]
[20]
[{"$f":"IF((INDIRECT(D34))=\"COMMERCIAL\",\"C\",IF((INDIRECT(D34))=\"RESIDENTIAL\",\"R\",IF((INDIRECT(D34))=\"\",\"C\",\"C\")))","v":"C"},null,null,"Sheet1!D21",null,"JOB TYPE"]
["O",null,null,"Sheet1!D22",null,"Taxable","Arun, fix this"]
[{"$f":"IF((INDIRECT(D36))=\"\",\".\",UPPER(INDIRECT(D36)))","v":"HOLLADAY 2550 LLC"},null,null,"Sheet1!D23",null,"OWNER NAME"]
["US"]
[{"$f":"IF((INDIRECT(D38))=\"\",\".\",UPPER(INDIRECT(D38)))","v":"9565 S WASATCH BLVD"},null,null,"Sheet1!D24",null,"OWNER ADDRESS"]
[".",null,null,"Sheet1!D24"]
[".",null,null,"Sheet1!D25"]
[{"$f":"IF((INDIRECT(D41)=\"\"),99329,INDIRECT(D41))","v":84092},null,null,"Sheet1!D27",null,"OWNER ZIP"]
[{"$f":"IF(ISERROR($J43),\"9\",(IF(($J43>24),\"P5\",IF(($J43>18),\"P4\",IF(($J43>12),\"P3\",IF(($J43>6),\"P2\",\"9\"))))))","v":"9"}]
[{"$f":"IF(G43=\"Y\",J43,\"9\")","v":{"$error":"#N/A"}},{"$f":"IF(A43=0,\"ERROR! Check city spelling and/or zip\",\"\")","v":{"$error":"#N/A"}},null,null,null,null,{"$f":"VLOOKUP(A41,[1]Sheet3!$A$1:$D$65536,4,FALSE)","v":{"$error":"#N/A"}},null,null,{"$f":"SUMPRODUCT(([1]Sheet3!$B$3:$B$8009=[1]Sheet1!$D$25)*([1]Sheet3!$A$3:$A$8009=[1]Sheet1!$D$27)*([1]Sheet3!$E$3:$E$8009))","v":0}]
["E"]
["E"]
["S"]
[{"$f":"IF((INDIRECT(D47))=\"\",\".\",UPPER(INDIRECT(D47)))","v":"OLD REPUBLIC SURETY COMPANY"},null,null,"Sheet1!B22",null,"SURETY NAME"]
["US"]
[{"$f":"IF((INDIRECT(D49))=\"\",\".\",UPPER(INDIRECT(D49)))","v":"."},null,null,"Sheet1!B230",null,"SURETY ADDRESS"]
[".",null,null,"Sheet1!B26"]
[".",null,null,"Sheet1!B27"]
[{"$f":"IF((INDIRECT(D52)=\"\"),99329,INDIRECT(D52))","v":5320},null,null,"Sheet1!B26",null,"SURETY ZIP"]
[{"$f":"IF(ISERROR($J54),\"9\",(IF(($J54>24),\"P5\",IF(($J54>18),\"P4\",IF(($J54>12),\"P3\",IF(($J54>6),\"P2\",\"9\"))))))","v":"9"}]
[{"$f":"IF(G54=\"Y\",J54,\"9\")","v":{"$error":"#N/A"}},{"$f":"IF(A54=0,\"ERROR! Check city spelling and/or zip\",\"\")","v":{"$error":"#N/A"}},null,null,null,"SURETY CITY",{"$f":"VLOOKUP(A52,[1]Sheet3!$A$1:$D$65536,4,FALSE)","v":{"$error":"#N/A"}},null,null,{"$f":"SUMPRODUCT(([1]Sheet3!$B$3:$B$8009=[1]Sheet1!$B$24)*([1]Sheet3!$A$3:$A$8009=[1]Sheet1!$B$26)*([1]Sheet3!$E$3:$E$8009))","v":0}]
["E"]
["E"]
["L"]
[{"$f":"IF((INDIRECT(D58))=\"\",\"NO LENDER\",UPPER(INDIRECT(D58)))","v":"FIRE SUPPRESSION SERVICES INC."},null,null,"Sheet1!D30",null,"LENDER NAME"]
["US"]
[{"$f":"IF((INDIRECT(D60))=\"\",\".\",UPPER(INDIRECT(D60)))","v":"."},null,null,"Sheet1!D31",null,"LENDER ADDRESS"]
["."]
["."]
[{"$f":"IF((INDIRECT(D63)=\"\"),99329,INDIRECT(D63))","v":99329},null,null,"Sheet1!D34",null,"LENDER ZIP"]
[{"$f":"IF(ISERROR($J65),\"9\",(IF(($J65>24),\"P5\",IF(($J65>18),\"P4\",IF(($J65>12),\"P3\",IF(($J65>6),\"P2\",\"9\"))))))","v":"9"}]
[{"$f":"IF(G65=\"Y\",J65,\"9\")","v":"9"},{"$f":"IF(A65=0,\"ERROR! Check city spelling and/or zip\",\"\")","v":""},null,null,null,"LENDER CITY",{"$f":"VLOOKUP(A63,[1]Sheet3!$A$1:$D$65536,4,FALSE)","v":"N"},null,null,{"$f":"SUMPRODUCT(([1]Sheet3!$B$3:$B$8009=[1]Sheet1!$D$32)*([1]Sheet3!$A$3:$A$8009=[1]Sheet1!$D$34)*([1]Sheet3!$E$3:$E$8009))","v":0}]
["E"]
["E"]
[27]
[60,"<---",null,null,null,"DAYS TO FILE LIEN"]
[21]
[{"$f":"IF((INDIRECT(D71))=\"YES\",\"Y\",IF((INDIRECT(D71))=\"NO\",\"N\",IF((INDIRECT(D71))=\"\",\"N\",UPPER(INDIRECT(D71)))))","v":"N"},null,null,"Sheet1!D20",null,"BONDED"]
[{"$f":"IF((INDIRECT(D72))=\"\",\".\",UPPER(INDIRECT(D72)))","v":"OLD REPUBLIC SURETY COMPANY"},null,null,"Sheet1!B22",null,"SURETY NAME"]
[{"$f":"IF((INDIRECT(D73))=\"\",\".\",UPPER(INDIRECT(D73)))","v":"N/A"},null,null,"Sheet1!B28",null,"BOND #"]
["."]
[{"$f":"IF(([1]Sheet1!B40=\"\"),\"S\",([1]Sheet1!B40))","v":"S"},null,null,"Sheet1!B40",null,"SURETY AM BEST RATING"]
["SA",null,null,null,null,"SUBMIT APP"]
[".",null,null,null,null,"BRANCH #"]
["N ",null,null,null,null,"ARE YOU SURE?"]
[{"$f":"IF((INDIRECT(D79))=\"\",\".\",UPPER(INDIRECT(D79)))","v":"FSS"},null,null,"Sheet1!B14",null,"GC NAME"]
["H"]
[4]
[{"$f":"IF((INDIRECT(D82))=\"\",\".\",UPPER(INDIRECT(D82)))","v":"FSS"},null,null,"Sheet1!B14",null,"GC NAME"]
["END",null,null,"Sheet1!B15",null,"GC ADDRESS"]
["END",null,null,"Sheet1!B17"]
[{"$f":"IF(INDIRECT(D85)=0,\"806-111-1111\",INDIRECT(D85))","v":8012776464},null,null,"Sheet1!B19",null,"GC PHONE"]
[{"$f":"IF(INDIRECT(D86)=0,\"806-111-1111\",INDIRECT(D86))","v":"806-111-1111"},null,null,"Sheet1!B20",null,"GC FAX"]
["."]
[{"$f":"IF((INDIRECT(D88))=\"\",\"WA\",UPPER(INDIRECT(D88)))","v":"UT"},null,null,"Sheet1!D15",null,"JOB STATE"]
[{"$f":"IF((INDIRECT(D89))=\"\",\"C\",UPPER(INDIRECT(D89)))","v":"COMMERCIAL"},null,null,"Sheet1!D21",null,"JOB TYPE"]
[{"$f":"IF((INDIRECT(D90))=\"YES\",\"Y\",IF((INDIRECT(D90))=\"NO\",\"N\",IF((INDIRECT(D90))=\"\",\"N\",UPPER(INDIRECT(D90)))))","v":"N"},null,null,"Sheet1!D20",null,"BONDED"]
[{"$f":"IF(([1]Sheet1!B40=\"\"),\"S\",([1]Sheet1!B40))","v":"S"},null,null,"Sheet1!B40",null,"SURETY AM BEST RATING"]
[{"$f":"INDIRECT(D92)","v":6000},null,null,"Sheet1!D19",null,"JOB AMOUNT"]
[]
[]
["Copy and paste the highlighted cells (light green) below into Trilogie in order to contract the bid to the job account."]
[2]
[2]
[24]
[null,"<----"]
["Y"]
[{"$f":"INDIRECT(D101)","v":0},null,null,"Sheet1!B39",null,"BID #"]
[{"$f":"INDIRECT(D102)","v":0},null,null,"Sheet1!B41",null,"CUST #"]
[" ",null,null,null,null,"BLANK"]
[{"$f":"TODAY()+365","v":"2023-12-20"},null,null,null,null,"1 YEAR FROM NOW"]
["E"]
[]
["."]
["END"]
["END"]
[]
[]
["Copy and paste the highlighted cells (light green) below into Trilogie in order to create the ship to suffix"]
["CFM"]
[{"$f":"INDIRECT(D114)","v":0},null,null,"Sheet1!B41",null,"NEW JOB #"]
["S"]
[1]
["Y"]
[{"$f":"INDIRECT(D118)","v":"Fire Suppression Services Incorporated"},null,null,"Sheet1!B7",null,"CUST NAME"]
["US",null,null,null,null,"COUNTRY"]
[{"$f":"INDIRECT(D120)","v":"La Caille"},null,null,"Sheet1!D7",null,"JOB NAME"]
[{"$f":"IF((INDIRECT(D121))=\"\",\".\",UPPER(INDIRECT(D121)))","v":"9565 SOUTH WASATCH BOULEVARD"},null,null,"Sheet1!D11",null,"JOB ADDRESS"]
[{"$f":"IF((INDIRECT(D122))=\"\",\".\",UPPER(INDIRECT(D122)))","v":"."},null,null,"Sheet1!D12",null,"JOB ADDRESS 2"]
[{"$f":"IF((INDIRECT(D123)=\"\"),99329,INDIRECT(D123))","v":84092},null,null,"Sheet1!D16",null,"JOB ZIP","Zip Multi"]
[{"$f":"IF(ISERROR($J125),\"9\",(IF(($J125>24),\"P5\",IF(($J125>18),\"P4\",IF(($J125>12),\"P3\",IF(($J125>6),\"P2\",\"9\"))))))","v":"9"}]
[{"$f":"IF(G125=\"Y\",J125,\"9\")","v":{"$error":"#N/A"}},{"$f":"IF(A125=0,\"ERROR! Check city spelling and/or zip\",\"\")","v":{"$error":"#N/A"}},null,null,null,"JOB CITY",{"$f":"VLOOKUP(A123,[1]Sheet3!$A$1:$D$65536,4,FALSE)","v":{"$error":"#N/A"}},null,null,{"$f":"SUMPRODUCT(([1]Sheet3!$B$3:$B$8009=[1]Sheet1!$D$14)*([1]Sheet3!$A$3:$A$8009=[1]Sheet1!$D$16)*([1]Sheet3!$E$3:$E$8009))","v":0}]
["E"]
[{"$f":"D127","v":"WA4200"},"<----",null,{"$f":"IF([1]Sheet1!D22=\"Y\",\"WAE\",IF([1]Sheet1!D22=\"YES\",\"WAE\",\"WA4200\"))","v":"WA4200"},null,"CHANGE THIS AFTER SETUP"]

{"sheet":"Sheet3","index":2,"n_rows":7355,"n_cols":5,"rows_kept":7355,"cut":false,"hidden":false,"merged":[]}
["CREDIT DEPARTMENT USE ONLY",null,null,"WA OR ID CA NV HI"]
["ZIP","City",null,"Multiple","City Loc"]
[6183,"HARTFORD",null,"Y",1]
[6183,"HFD",null,"Y",1]
[6183,"HTFD",null,"Y",1]
[6183,"TRAVELERS INS",null,"Y",1]
[10270,"NEW YORK",null,"Y",2]
[19106,"Philadelphia",null,"Y",2]
[32814,"ORLANDO",null,"N",1]
[57117,"Sioux Falls",null,"N",1]
[60196,"SCHAUMBURG",null,"Y",3]
[83201,"ALAMEDA",null,"Y",1]
[83201,"POCATELLO",null,"Y",2]
[83201,"TYHEE",null,"Y",3]
[83201,"WESTWOOD VILLAGE",null,"Y",4]
[83202,"CHUBBUCK",null,"Y",1]
[83202,"POCATELLO",null,"Y",2]
[83203,"FORT HALL",null,"Y",1]
[83203,"FORT HALL INDIAN RESERVATION",null,"Y",2]
[83203,"FT HALL",null,"Y",3]
[83203,"GIBSON",null,"Y",4]
[83203,"POCATELLO",null,"Y",5]
[83204,"BANNOCK",null,"Y",1]
[83204,"POCATELLO",null,"Y",2]
[83205,"POCATELLO",null,"N",1]
[83206,"ALAMEDA",null,"Y",1]
[83206,"POCATELLO",null,"Y",2]
[83209,"POCATELLO",null,"N",1]
[83210,"ABERDEEN",null,"Y",1]
[83210,"STERLING",null,"Y",2]
[83211,"AM FALLS",null,"Y",1]
[83211,"AMERICAN FALLS",null,"Y",2]
[83211,"HEGLAR",null,"Y",3]
[83211,"NEELEY",null,"Y",4]
[83211,"RAFT RIVER",null,"Y",5]
[83212,"ARBON",null,"N",1]
[83213,"ARCO",null,"Y",1]
[83213,"CRATERS OF THE MOON NATIONAL",null,"Y",2]
[83214,"ARIMO",null,"Y",1]
[83214,"GARDEN CREEK",null,"Y",2]
[83214,"HAWKINS",null,"Y",3]
[83214,"ROBIN",null,"Y",4]
[83215,"ATOMIC CITY",null,"N",1]
[83217,"BANCROFT",null,"Y",1]
[83217,"CHESTERFIELD",null,"Y",2]
[83217,"LUND",null,"Y",3]
[83217,"PEBBLE",null,"Y",4]
[83218,"BASALT",null,"N",1]
[83220,"BERN",null,"Y",1]
[83220,"MONTPELIER",null,"Y",2]
[83221,"BLACKFOOT",null,"Y",1]
[83221,"GROVELAND",null,"Y",2]
[83221,"RIVERSIDE",null,"Y",3]
[83221,"ROCKFORD",null,"Y",4]
[83221,"ROSE",null,"Y",5]
[83221,"TABER",null,"Y",6]
[83221,"THOMAS",null,"Y",7]
[83221,"THOMAS JUNCTION",null,"Y",8]
[83221,"WAPELLO",null,"Y",9]
[83223,"BLOOMINGTON",null,"N",1]
[83226,"CHALLIS",null,"N",1]
[83227,"CLAYTON",null,"Y",1]
[83227,"TORREY",null,"Y",2]
[83228,"CLIFTON",null,"N",1]
[83229,"CHALLIS",null,"Y",1]
[83229,"COBALT",null,"Y",2]
[83230,"CONDA",null,"Y",1]
[83230,"HENRY",null,"Y",2]
[83230,"SODA SPRINGS",null,"Y",3]
[83232,"DAYTON",null,"N",1]
[83233,"DINGLE",null,"N",1]
[83234,"DOWNEY",null,"Y",1]
[83234,"VIRGINIA",null,"Y",2]
[83235,"ELLIS",null,"N",1]
[83236,"FIRTH",null,"Y",1]
[83236,"KIMBALL",null,"Y",2]
[83236,"LOWER PRESTO",null,"Y",3]
[83237,"FRANKLIN",null,"N",1]
[83238,"GENEVA",null,"Y",1]
[83238,"RAYMOND",null,"Y",2]
[83239,"GEORGETOWN",null,"N",1]
[83241,"BENCH",null,"Y",1]
[83241,"CENTRAL",null,"Y",2]
[83241,"GRACE",null,"Y",3]
[83241,"LAGO",null,"Y",4]
[83241,"NITER",null,"Y",5]
[83241,"TURNER",null,"Y",6]
[83243,"HOLBROOK",null,"N",1]
[83244,"CLYDE",null,"Y",1]
[83244,"HOWE",null,"Y",2]
[83245,"INKOM",null,"N",1]
[83246,"LAVA HOT SPRINGS",null,"Y",1]
[83246,"TOPAZ",null,"Y",2]
[83250,"MCCAMMON",null,"N",1]
[83251,"CHILLY",null,"Y",1]
[83251,"MACKAY",null,"Y",2]
[83252,"CHERRY CREEK",null,"Y",1]
[83252,"DANIELS",null,"Y",2]
[83252,"GWENFORD",null,"Y",3]
[83252,"MALAD",null,"Y",4]
[83252,"MALAD CITY",null,"Y",5]
[83252,"PLEASANTVIEW",null,"Y",6]
[83252,"STONE",null,"Y",7]
[83252,"WOODRUFF",null,"Y",8]
[83253,"MAY",null,"Y",1]
[83253,"PATTERSON",null,"Y",2]
[83254,"BENNINGTON",null,"Y",1]
[83254,"LIBERTY",null,"Y",2]
[83254,"MONTPELIER",null,"Y",3]
[83254,"NOUNAN",null,"Y",4]
[83254,"OVID",null,"Y",5]
[83254,"PEGRAM",null,"Y",6]
[83254,"WARDBORO",null,"Y",7]
[83255,"DARLINGTON",null,"Y",1]
[83255,"GROUSE",null,"Y",2]
[83255,"LESLIE",null,"Y",3]
[83255,"MOORE",null,"Y",4]
[83256,"MORELAND",null,"N",1]
[83261,"DINGLE",null,"Y",1]
[83261,"GLENCOE",null,"Y",2]
[83261,"PARIS",null,"Y",3]
[83262,"PINGREE",null,"N",1]
[83263,"FAIRVIEW",null,"Y",1]
[83263,"GLENDALE",null,"Y",2]
[83263,"MAPLETON",null,"Y",3]
[83263,"MINK CREEK",null,"Y",4]
[83263,"OXFORD",null,"Y",5]
[83263,"PRESTON",null,"Y",6]
[83263,"RIVERDALE",null,"Y",7]
[83263,"TREASURETON",null,"Y",8]
[83263,"WHITNEY",null,"Y",9]
[83271,"ROCKLAND",null,"Y",1]
[83271,"ROY",null,"Y",2]
[83272,"SAINT CHARLES",null,"Y",1]
[83272,"ST CHARLES",null,"Y",2]
[83274,"GOSHEN",null,"Y",1]
[83274,"JAMESTOWN",null,"Y",2]
[83274,"SHELLEY",null,"Y",3]
[83274,"WOODVILLE",null,"Y",4]
[83276,"SODA SPRINGS",null,"N",1]
[83277,"SPRINGFIELD",null,"N",1]
[83278,"BONANZA",null,"Y",1]
[83278,"LOWER STANLEY",null,"Y",2]
[83278,"REDFISH LAKE",null,"Y",3]
[83278,"STANLEY",null,"Y",4]
[83278,"SUNBEAM",null,"Y",5]
[83280,"MALAD CITY",null,"Y",1]
[83280,"STONE",null,"Y",2]
[83281,"SWANLAKE",null,"N",1]
[83283,"GRACE",null,"Y",1]
[83283,"THATCHER",null,"Y",2]
[83285,"GRAY",null,"Y",1]
[83285,"SODA SPRINGS",null,"Y",2]
[83285,"WAYAN",null,"Y",3]
[83286,"LINROSE",null,"Y",1]
[83286,"WESTON",null,"Y",2]
[83287,"FISH HAVEN",null,"Y",1]
[83287,"PARIS",null,"Y",2]
[83301,"HOLLISTER",null,"Y",1]
[83301,"LYNWOOD",null,"Y",2]
[83301,"THREE CREEK",null,"Y",3]
[83301,"TWIN FALLS",null,"Y",4]
[83302,"ROGERSON",null,"Y",1]
[83302,"THREE CREEK",null,"Y",2]
[83302,"TWIN FALLS",null,"Y",3]
[83303,"TWIN FALLS",null,"Y",2]
[83311,"ALBION",null,"N",1]
[83312,"ALMO",null,"N",1]
[83313,"BELLEVUE",null,"Y",1]
[83313,"BROADFORD",null,"Y",2]
[83313,"GANNETT",null,"Y",3]
[83314,"BLISS",null,"Y",1]
[83314,"MELLON VALLEY",null,"Y",2]
[83314,"TUTTLE",null,"Y",3]
[83316,"BUHL",null,"Y",1]
[83316,"CLOVER",null,"Y",2]
[83316,"DEEP CREEK",null,"Y",3]
[83318,"BURLEY",null,"Y",1]
[83318,"PELLA",null,"Y",2]
[83318,"SPRINGDALE",null,"Y",3]
[83318,"STARRHS FERRY",null,"Y",4]
[83318,"VIEW",null,"Y",5]
[83320,"CAREY",null,"Y",1]
[83320,"MULDOON",null,"Y",2]
[83321,"CASTLEFORD",null,"Y",1]
[83321,"ROSEWORTH",null,"Y",2]
[83322,"CORRAL",null,"Y",1]
[83322,"FAIRFIELD",null,"Y",2]
[83323,"COTTEREL",null,"Y",1]
[83323,"DECLO",null,"Y",2]
[83323,"IDAHOME",null,"Y",3]
[83324,"DIETRICH",null,"Y",1]
[83324,"SHOSHONE",null,"Y",2]
[83325,"EDEN",null,"N",1]
[83326,"ELBA",null,"N",1]
[83327,"FAIRFIELD",null,"N",1]
[83328,"CURRY",null,"Y",1]
[83328,"FILER",null,"Y",2]
[83330,"GOODING",null,"N",1]
[83332,"HAGERMAN",null,"N",1]
[83333,"HAILEY",null,"Y",1]
[83333,"HOT SPRING LANDING",null,"Y",2]
[83333,"MAGIC CITY",null,"Y",3]
[83333,"TRIUMPH",null,"Y",4]
[83334,"HANSEN",null,"Y",1]
[83334,"ROCK CREEK",null,"Y",2]
[83335,"GREENWOOD",null,"Y",1]
[83335,"HAZELTON",null,"Y",2]
[83335,"HUNT",null,"Y",3]
[83336,"HEYBURN",null,"N",1]
[83337,"HILL CITY",null,"N",1]
[83338,"APPLETON",null,"Y",1]
[83338,"BARRYMORE",null,"Y",2]
[83338,"FALLS CITY",null,"Y",3]
[83338,"JEROME",null,"Y",4]
[83338,"SUGAR LOAF",null,"Y",5]
[83340,"KETCHUM",null,"Y",1]
[83340,"OBSIDIAN",null,"Y",2]
[83341,"KIMBERLY",null,"N",1]
[83342,"BRIDGE",null,"Y",1]
[83342,"CONNER",null,"Y",2]
[83342,"MALTA",null,"Y",3]
[83342,"NAF",null,"Y",4]
[83342,"SUBLETT",null,"Y",5]
[83343,"MINIDOKA",null,"Y",1]
[83343,"RUPERT",null,"Y",2]
[83344,"MURTAUGH",null,"N",1]
[83346,"BASIN",null,"Y",1]
[83346,"CHURCHILL",null,"Y",2]
[83346,"MARION",null,"Y",3]
[83346,"OAKLEY",null,"Y",4]
[83347,"PAUL",null,"N",1]
[83348,"PICABO",null,"Y",2]
[83349,"BURMAH",null,"Y",1]
[83349,"RICHFIELD",null,"Y",2]
[83350,"ACEQUIA",null,"Y",1]
[83350,"JACKSON",null,"Y",2]
[83350,"RUPERT",null,"Y",3]
[83352,"LONE STAR",null,"Y",1]
[83352,"MAGIC RESORT",null,"Y",2]
[83352,"SHOSHONE",null,"Y",3]
[83353,"SUN VALLEY",null,"N",1]
[83354,"ELK HORN",null,"Y",1]
[83354,"SUN VALLEY",null,"Y",2]
[83355,"WENDELL",null,"N",1]
[83401,"BEACHS CORNER",null,"Y",1]
[83401,"BONE",null,"Y",2]
[83401,"COLTMAN",null,"Y",3]
[83401,"GARFIELD",null,"Y",4]
[83401,"GRANT",null,"Y",5]
[83401,"HILLVIEW",null,"Y",6]
[83401,"IDAHO FALLS",null,"Y",7]
[83401,"LINCOLN",null,"Y",8]
[83401,"NEW SWEDEN",null,"Y",9]
[83401,"OSGOOD",null,"Y",10]
[83401,"SAINT LEON",null,"Y",11]
[83401,"SHELTON",null,"Y",12]
[83401,"SKYLINE",null,"Y",13]
[83401,"TAYLOR",null,"Y",14]
[83402,"EAGLE ROCK",null,"Y",1]
[83402,"IDAHO FALLS",null,"Y",2]
[83403,"IDAHO FALLS",null,"N",1]
[83404,"IDAHO FALLS",null,"N",1]
[83405,"IDAHO FALLS",null,"N",1]
[83406,"AMMON",null,"Y",1]
[83406,"IDAHO FALLS",null,"Y",2]
[83415,"IDAHO FALLS",null,"N",1]
[83420,"ASHTON",null,"Y",1]
[83420,"ASHTON",null,"Y",2]
[83420,"DRUMMOND",null,"Y",3]
[83420,"LAMONT",null,"Y",4]
[83420,"MARYSVILLE",null,"Y",5]
[83420,"WARM RIVER",null,"Y",6]
[83421,"CHESTER",null,"N",1]
[83422,"BATES",null,"Y",1]
[83422,"DRIGGS",null,"Y",2]
[83423,"ARGORA",null,"Y",1]
[83423,"DUBOIS",null,"Y",2]
[83423,"IDMAN",null,"Y",3]
[83423,"KILGORE",null,"Y",4]
[83423,"LIDY HOT SPRINGS",null,"Y",5]
[83423,"RENO",null,"Y",6]
[83423,"SMALL",null,"Y",7]
[83424,"FELT",null,"Y",1]
[83424,"TETONIA",null,"Y",2]
[83425,"HAMER",null,"N",1]
[83427,"IONA",null,"N",1]
[83428,"IRWIN",null,"Y",1]
[83428,"PALISADES",null,"Y",2]
[83429,"BOX CANYON",null,"Y",1]
[83429,"ISLAND PARK",null,"Y",2]
[83429,"LAST CHANCE RESORT",null,"Y",3]
[83429,"PONDS RESORT",null,"Y",4]
[83431,"LEWISVILLE",null,"N",1]
[83433,"BIG SPRINGS",null,"Y",1]
[83433,"ISLAND PARK",null,"Y",2]
[83433,"MACKS INN",null,"Y",3]
[83434,"MENAN",null,"N",1]
[83435,"MONTEVIEW",null,"N",1]
[83436,"CANYON CREEK",null,"Y",1]
[83436,"CLEMENTSVILLE",null,"Y",2]
[83436,"NEWDALE",null,"Y",3]
[83438,"PARKER",null,"N",1]
[83440,"ARCHER",null,"Y",1]
[83440,"BURTON",null,"Y",2]
[83440,"EDMONDS",null,"Y",3]
[83440,"LYMAN",null,"Y",4]
[83440,"PLANO",null,"Y",5]
[83440,"REXBURG",null,"Y",6]
[83440,"SUNNYDELL",null,"Y",7]
[83440,"THORNTON",null,"Y",8]
[83441,"REXBURG",null,"N",1]
[83442,"ANNIS",null,"Y",1]
[83442,"LABELLE",null,"Y",2]
[83442,"LORENZO",null,"Y",3]
[83442,"RIGBY",null,"Y",4]
[83443,"ANTELOPE",null,"Y",1]
[83443,"HEISE",null,"Y",2]
[83443,"RIRIE",null,"Y",3]
[83444,"ROBERTS",null,"N",1]
[83445,"ANTHONY",null,"Y",1]
[83445,"EGIN",null,"Y",2]
[83445,"HEMAN",null,"Y",3]
[83445,"SAINT ANTHONY",null,"Y",4]
[83445,"TWIN GROVES",null,"Y",5]
[83445,"WILFORD",null,"Y",6]
[83446,"DUBOIS",null,"Y",1]
[83446,"HUMPHREY",null,"Y",2]
[83446,"SPENCER",null,"Y",3]
[83447,"ASHTON",null,"Y",1]
[83447,"ASHTON",null,"Y",2]
[83447,"SQUIRREL",null,"Y",3]
[83448,"SUGAR CITY",null,"N",1]
[83449,"SWAN VALLEY",null,"N",1]
[83450,"MUD LAKE",null,"Y",1]
[83450,"TERRETON",null,"Y",2]
[83451,"TETON",null,"N",1]
[83452,"CLAWSON",null,"Y",1]
[83452,"TETONIA",null,"Y",2]
[83454,"UCON",null,"N",1]
[83455,"FOX CREEK",null,"Y",1]
[83455,"VERNON",null,"Y",2]
[83455,"VICTOR",null,"Y",3]
[83460,"REXBURG",null,"N",1]
[83462,"CARMEN",null,"N",1]
[83463,"GIBBONSVILLE",null,"N",1]
[83464,"BLUE DOME",null,"Y",1]
[83464,"LEADORE",null,"Y",2]
[83464,"LONE PINE",null,"Y",3]
[83465,"LEMHI",null,"N",1]
[83466,"NORTH FORK",null,"N",1]
[83467,"BAKER",null,"Y",1]
[83467,"ELK BEND",null,"Y",2]
[83467,"SALMON",null,"Y",3]
[83468,"TENDOY",null,"N",1]
[83469,"NORTH FORK",null,"Y",1]
[83469,"SHOUP",null,"Y",2]
[83501,"LEWISTON",null,"N",1]
[83520,"AHSAHKA",null,"N",1]
[83522,"COTTONWOOD",null,"Y",1]
[83522,"KEUTERVILLE",null,"Y",2]
[83523,"CRAIGMONT",null,"N",1]
[83524,"CULDESAC",null,"N",1]
[83525,"DIXIE",null,"Y",1]
[83525,"ELK CITY",null,"Y",2]
[83526,"FERDINAND",null,"N",1]
[83530,"GRANGEVILLE",null,"N",1]
[83531,"FENN",null,"Y",1]
[83531,"GRANGEVILLE",null,"Y",2]
[83533,"COTTONWOOD",null,"Y",1]
[83533,"GREENCREEK",null,"Y",2]
[83535,"JULIAETTA",null,"N",1]
[83536,"KAMIAH",null,"N",1]
[83537,"KENDRICK",null,"Y",1]
[83537,"SOUTHWICK",null,"Y",2]
[83538,"COTTONWOOD",null,"Y",1]
[83538,"KEUTERVILLE",null,"Y",2]
[83539,"CLEARWATER",null,"Y",1]
[83539,"KOOSKIA",null,"Y",2]
[83539,"LOWELL",null,"Y",3]
[83539,"SYRINGA",null,"Y",4]
[83540,"LAPWAI",null,"Y",1]
[83540,"SWEETWATER",null,"Y",2]
[83541,"LENORE",null,"N",1]
[83542,"LUCILE",null,"N",1]
[83543,"NEZPERCE",null,"N",1]
[83544,"GREER",null,"Y",1]
[83544,"OROFINO",null,"Y",2]
[83545,"PECK",null,"N",1]
[83546,"HEADQUARTERS",null,"Y",1]
[83546,"PIERCE",null,"Y",2]
[83547,"POLLOCK",null,"N",1]
[83548,"CULDESAC",null,"Y",1]
[83548,"REUBENS",null,"Y",2]
[83549,"RIGGINS",null,"N",1]
[83551,"SPALDING",null,"N",1]
[83552,"STITES",null,"N",1]
[83553,"WEIPPE",null,"N",1]
[83554,"COOPERVILLE",null,"Y",1]
[83554,"WHITE BIRD",null,"Y",2]
{"$rows_left_out":6956}
{"sheet":"Notes","index":3,"n_rows":26,"n_cols":5,"rows_kept":26,"cut":false,"hidden":false,"merged":[]}
[]
[]
[null,null,null,"First make sure your security settings allow you to run macros:"]
[null,null,null,null,"Click the MS icon at upper left of the Excel window"]
[null,null,null,null,"then click Excel Options at the bottom of the menu that opens"]
[null,null,null,null,"Click Trust Center and then Trust Center Settings"]
[null,null,null,null,"then click Macro Settings"]
[null,null,null,null," make sure there is a check in the Trust Access to VBA box."]
[null,null,null,null,"Set your macro security level and then close everything."]
[]
[null,null,null,"AND","Go to 'Developer Ribbon'."]
[null,null,null,null,"Click Macro Security."]
[null,null,null,null,"Click 'Privacy Options'."]
[null,null,null,null,"Uncheck Document Inspector"]
[]
[null,null,null,"Also","Up above the column letters, above sheet tile bar you will see"]
[]
[]
[]
[]
[]
[]
[]
[null,null,null,null,"Click Options"]
[null,null,null,null,"Choose 'Enable this Content' in next window"]
[null,null,null,null,"Click 'OK' "]